Page MenuHomePhorge

Build 643
FailedPublic

Run Command

This build step has since been deleted on the build plan. Some information may be omitted.
When
Completed at Jun 9 2015, 8:19 AM · Built for 1 m, 23 s
Status
Failed

Build Log 2348 (remote - stderr)
25 - 50 - 100 - Unlimited Lines

38+ git clone https://git.kolab.org/diffusion/QA/stick.git stick.git
39+ export commit
40+ export differential
41+ export id
42+ export package
43+ export phid
44+ export ro_uri
45+ export uri
46+ export vcs
47+ export test_build
48+ export test_functional
49+ export test_integration
50+ export test_performance
51+ export test_unit
52+ '[' -x stick.git/drydocker/pykolab/build.sh ']'
53+ pushd pykolab.git
54+ ../stick.git/drydocker/pykolab/build.sh
55+ docker run -it --attach=stdout --attach=stderr --detach=false --rm=true --volume=/root/.oscrc:/root/.oscrc --hostname=kolab.example.org -e ID=643 -e COMMIT=ac1ab08b8611b7f5b8b6e0f0834f801f75e73918 -e DIFFERENTIAL= -e PACKAGE=pykolab -e PHAB_CERT= -e PHAB_USER= -e PHID=PHID-HMBT-xoog3w6dczuqh67zvcaf -e URI=ssh://git@git.kolab.org/diffusion/P/pykolab.git -e RO_URI=https://git.kolab.org/diffusion/P/pykolab.git -e VCS=git -e TEST_BUILD=1 -e TEST_FUNCTIONAL=1 -e TEST_INTEGRATION=1 -e TEST_PERFORMANCE=1 -e TEST_UNIT=1 kolab/ci-maipo
56+ exit 1
57+ retval=1
58+ popd
59+ cd /var/tmp
60+ rm -rf /var/tmp/890
61+ exit 1
62

Build Log 2347 (remote - stdout)
25 - 50 - 100 - Unlimited Lines

1979FailTest: not equal:
1980a = 'uid=doe,ou=People,dc=example,dc=org'
1981b = None
1982
1983
1984======================================================================
1985FAIL: test_003_set_lang (tests.unit.test-015-translate.TestTranslate)
1986----------------------------------------------------------------------
1987Traceback (most recent call last):
1988 File "/srv/pykolab.git/tests/unit/test-015-translate.py", line 18, in test_003_set_lang
1989 self.assertEqual(_("Folder name"), "Ordnername", "German Translation found")
1990AssertionError: German Translation found
1991
1992----------------------------------------------------------------------
1993Ran 135 tests in 4.128s
1994
1995FAILED (errors=3, failures=9)
1996Running ../stick.git/drydocker/pykolab/test_unit.sh FAILED (at ac1ab08b8611b7f5b8b6e0f0834f801f75e73918)
1997========================================================================
1998 Running 'yum-builddep -y --disablerepo=openSUSE_Tools pykolab' OK (at ac1ab08b8611b7f5b8b6e0f0834f801f75e73918)
1999 Running '../stick.git/drydocker/pykolab/test_build.sh' OK (at ac1ab08b8611b7f5b8b6e0f0834f801f75e73918)
2000 Running '../stick.git/drydocker/pykolab/test_unit.sh' FAILED (at ac1ab08b8611b7f5b8b6e0f0834f801f75e73918)
2001========================================================================
2002/var/tmp/890
2003

Lease Host

This build step has since been deleted on the build plan. Some information may be omitted.
When
Completed at Jun 9 2015, 8:18 AM · Built for 2 s
Status
Passed

Wait for Previous Commits to Build

When
Completed at Jun 9 2015, 8:18 AM · Built instantly
Status
Passed
1 empty logs are hidden. Show all logs.

Event Timeline