Page MenuHomePhorge

Build 591
FailedPublic

Run Command

This build step has since been deleted on the build plan. Some information may be omitted.
When
Completed at May 29 2015, 2:55 PM · Built for 50 s
Status
Failed

Build Log 2192 (remote - stderr)
25 - 50 - 100 - Unlimited Lines

38+ git clone https://git.kolab.org/diffusion/QA/stick.git stick.git
39+ export commit
40+ export differential
41+ export id
42+ export package
43+ export phid
44+ export ro_uri
45+ export uri
46+ export vcs
47+ export test_build
48+ export test_functional
49+ export test_integration
50+ export test_performance
51+ export test_unit
52+ '[' -x stick.git/drydocker/pykolab/build.sh ']'
53+ pushd pykolab.git
54+ ../stick.git/drydocker/pykolab/build.sh
55+ docker run -it --attach=stdout --attach=stderr --detach=false --rm=true --volume=/root/.oscrc:/root/.oscrc --hostname=kolab.example.org -e ID=591 -e COMMIT=a6984e9e29a3cd6beca7f717ad3484e846358fbc -e DIFFERENTIAL= -e PACKAGE=pykolab -e PHAB_CERT= -e PHAB_USER= -e PHID=PHID-HMBT-dya7nc7sfzv3xexamopn -e URI=ssh://git@git.kolab.org/diffusion/P/pykolab.git -e RO_URI=https://git.kolab.org/diffusion/P/pykolab.git -e VCS=git -e TEST_BUILD=1 -e TEST_FUNCTIONAL=1 -e TEST_INTEGRATION=1 -e TEST_PERFORMANCE=1 -e TEST_UNIT=1 kolab/ci-maipo
56+ exit 1
57+ retval=1
58+ popd
59+ cd /var/tmp
60+ rm -rf /var/tmp/838
61+ exit 1
62

Build Log 2191 (remote - stdout)
25 - 50 - 100 - Unlimited Lines

1882FailTest: not equal:
1883a = 'uid=doe,ou=People,dc=example,dc=org'
1884b = None
1885
1886
1887======================================================================
1888FAIL: test_003_set_lang (tests.unit.test-015-translate.TestTranslate)
1889----------------------------------------------------------------------
1890Traceback (most recent call last):
1891 File "/srv/pykolab.git/tests/unit/test-015-translate.py", line 18, in test_003_set_lang
1892 self.assertEqual(_("Folder name"), "Ordnername", "German Translation found")
1893AssertionError: German Translation found
1894
1895----------------------------------------------------------------------
1896Ran 135 tests in 4.035s
1897
1898FAILED (errors=3, failures=9)
1899Running ../stick.git/drydocker/pykolab/test_unit.sh FAILED (at a6984e9e29a3cd6beca7f717ad3484e846358fbc)
1900========================================================================
1901 Running 'yum-builddep -y --disablerepo=openSUSE_Tools pykolab' OK (at a6984e9e29a3cd6beca7f717ad3484e846358fbc)
1902 Running '../stick.git/drydocker/pykolab/test_build.sh' OK (at a6984e9e29a3cd6beca7f717ad3484e846358fbc)
1903 Running '../stick.git/drydocker/pykolab/test_unit.sh' FAILED (at a6984e9e29a3cd6beca7f717ad3484e846358fbc)
1904========================================================================
1905/var/tmp/838
1906

Lease Host

This build step has since been deleted on the build plan. Some information may be omitted.
When
Completed at May 29 2015, 2:54 PM · Built for 1 s
Status
Passed

Wait for Previous Commits to Build

When
Completed at May 29 2015, 2:54 PM · Built instantly
Status
Passed
1 empty logs are hidden. Show all logs.

Event Timeline