Page MenuHomekolab.org

Build 3418

Drydock: Run Command

When
Completed at Apr 22 2016, 4:55 PM · Built for 10 m, 32 s
Status
Failed

Build Log 10430 (remote - stderr)
25 - 50 - 100 - Unlimited Lines

6+ test_performance=1
7+ test_unit=1
8+ test_obs=1
9+ '[' -z git ']'
10+ case ${vcs} in
11++ basename ssh://git@git.kolab.org/diffusion/LK/libkolab.git .git
12+ package=libkolab
13++ echo ssh://git@git.kolab.org/diffusion/LK/libkolab.git
14++ sed -e 's|ssh://git@|https://|g'
15+ ro_uri=https://git.kolab.org/diffusion/LK/libkolab.git
16+ case ${package} in
17++ pwd
18+ export TMPDIR=/var/drydock/workingcopy-215935/repo/libkolab
19+ TMPDIR=/var/drydock/workingcopy-215935/repo/libkolab
20+ '[' '!' -d libkolab.git ']'
21+ pushd libkolab.git
22+ git remote set-url origin https://git.kolab.org/diffusion/LK/libkolab.git
23+ git fetch origin
24From https://git.kolab.org/diffusion/LK/libkolab
25 b743647..899b66c libkolab-0.6 -> origin/libkolab-0.6
26From https://git.kolab.org/diffusion/LK/libkolab
27 * [new tag] libkolab-0.6.2 -> libkolab-0.6.2
28+ git reset --hard origin/master
29+ git clean -d -f -x
30+ git checkout 65aaf8504a5fd0bc6775ef52686bf1c8a9e3b5bb
31Previous HEAD position was 782a888... Merge branch 'master' of https://git.kolab.org/diffusion/LK/libkolab
32HEAD is now at 65aaf85... Intercept debug messages when building with libcalendaring.
33+ popd
34+ '[' libkolab '!=' stick ']'
35+ '[' '!' -d stick.git ']'
36+ pushd stick.git
37+ git remote set-url origin https://git.kolab.org/diffusion/QA/stick.git
38+ git fetch origin
39+ git reset --hard origin/master
40+ git clean -d -f -x
41+ popd
42+ export commit
43+ export differential
44+ export id
45+ export package
46+ export phid
47+ export ro_uri
48+ export uri
49+ export vcs
50+ export test_build
51+ export test_functional
52+ export test_integration
53+ export test_performance
54+ export test_unit
55+ export test_obs
56+ '[' '!' -d /var/tmp/osbuild-packagecache ']'
57+ '[' -x stick.git/drydocker/libkolab/build.sh ']'
58+ pushd libkolab.git
59+ ../stick.git/drydocker/libkolab/build.sh
60+ docker run -i --attach=stdout --attach=stderr --detach=false --rm=true --volume=/root/.oscrc:/root/.oscrc --volume=/var/tmp/osbuild-packagecache/:/var/tmp/osbuild-packagecache/ --hostname=kolab.example.org -e ID=3418 -e COMMIT=65aaf8504a5fd0bc6775ef52686bf1c8a9e3b5bb -e DIFFERENTIAL= -e PACKAGE=libkolab -e PHAB_CERT= -e PHAB_USER= -e PHID=PHID-HMBT-qer3ztfbo5hb2lusynay -e URI=ssh://git@git.kolab.org/diffusion/LK/libkolab.git -e RO_URI=https://git.kolab.org/diffusion/LK/libkolab.git -e VCS=git -e TEST_BUILD=1 -e TEST_FUNCTIONAL=1 -e TEST_INTEGRATION=1 -e TEST_PERFORMANCE=1 -e TEST_UNIT=1 -e TEST_OBS=1 kolab/ci-maipo
61Switched to a new branch 'buildsystem'
62Switched to a new branch 'datetimeutils'
63Switched to a new branch 'dev/dateonly_bday'
64Switched to a new branch 'dev/dummyswigplugin'
65Switched to a new branch 'dev/fix_generic_tag'
66Switched to a new branch 'dev/fix_memberurl'
67Switched to a new branch 'dev/frameworks'
68Switched to a new branch 'dev/support_exceptions'
69Switched to a new branch 'dev/tag_color'
70Switched to a new branch 'dev/tag_generic'
71Switched to a new branch 'dev/unifiedphpmodule'
72Switched to a new branch 'dev/windows-0.6'
73Switched to a new branch 'encoding'
74Switched to a new branch 'feature/relations'
75Switched to a new branch 'feature/remoterelationsync'
76Switched to a new branch 'files'
77Switched to a new branch 'formatchecker'
78Switched to a new branch 'libcalendaring'
79Switched to a new branch 'libkolab-0.2'
80Switched to a new branch 'libkolab-0.3'
81Switched to a new branch 'libkolab-0.4'
82Switched to a new branch 'libkolab-0.5'
83Switched to a new branch 'libkolab-0.6'
84Switched to a new branch 'libkolab-0.7'
85Switched to a new branch 'libkolab-1.0'
86Switched to branch 'master'
87Switched to a new branch 'mimeobject'
88Switched to a new branch 'timezones'
89Note: checking out '65aaf8504a5fd0bc6775ef52686bf1c8a9e3b5bb'.
90
91You are in 'detached HEAD' state. You can look around, make experimental
92changes and commit them, and you can discard any commits you make in this
93state without impacting any branches by performing another checkout.
94
95If you want to create a new branch to retain commits you create, you may
96do so (now or later) by using -b with the checkout command again. Example:
97
98 git checkout -b new_branch_name
99
100HEAD is now at 65aaf85... Intercept debug messages when building with libcalendaring.
101+ exit 1
102+ retval=1
103+ popd
104+ exit 1
105

Build Log 10429 (remote - stdout)
25 - 50 - 100 - Unlimited Lines

6904ATTENDEE;CN=3D"name1";RSVP=3DFALSE;PARTSTAT=3DNEEDS-ACTION;ROLE=3DREQ-P=
6905ARTICIPANT;
6906 CUTYPE=3DINDIVIDUAL;X-UID=3D29915456:mailto:email1@test.org
6907ATTENDEE;CN=3D"name2";RSVP=3DFALSE;PARTSTAT=3DNEEDS-ACTION;ROLE=3DREQ-P=
6908ARTICIPANT;
6909 CUTYPE=3DINDIVIDUAL;X-UID=3D30099616:mailto:email2@test.org
6910CREATED:20111011T120103Z
6911UID:e484cbbe-fb7c-4e34-b607-541828491a77
6912LAST-MODIFIED:20111011T120102Z
6913SUMMARY:summary
6914DTSTART:20111010T100101Z
6915DTEND:20120505T010404Z
6916TRANSP:OPAQUE
6917REQUEST-STATUS:2.0;Success.
6918END:VEVENT
6919END:VCALENDAR
6920
6921--nextPart2325110.mvXUDI8C0e--
6922"
6923XFAIL : ICalendarTest::testToIMip() to imip converts dates to utc
6924 Loc: [/srv/libkolab.git/tests/icalendartest.cpp(143)]
6925XFAIL : ICalendarTest::testToIMip() to imip converts dates to utc
6926 Loc: [/srv/libkolab.git/tests/icalendartest.cpp(145)]
6927PASS : ICalendarTest::testToIMip()
6928PASS : ICalendarTest::cleanupTestCase()
6929Totals: 9 passed, 0 failed, 0 skipped
6930********* Finished testing of ICalendarTest *********
6931********* Start testing of KCalConversionTest *********
6932Config: Using QTest library 4.8.5, Qt 4.8.5
6933QDEBUG : KCalConversionTest::initTestCase() kcalconversiontest(1841) KSystemTimeZonesPrivate::readConfig: readConfig(): local zone= "UTC"
6934QDEBUG : KCalConversionTest::initTestCase() kcalconversiontest(1841) KSystemTimeZonesPrivate::readZoneTab: readZoneTab( "/usr/share/zoneinfo/zone.tab" )
6935PASS : KCalConversionTest::initTestCase()
6936PASS : KCalConversionTest::testDate()
6937PASS : KCalConversionTest::testDuration()
6938(14:55:11) kcalconversion.cpp(724): skipping disabled alarm
6939PASS : KCalConversionTest::testConversion()
6940PASS : KCalConversionTest::testTodoConversion()
6941PASS : KCalConversionTest::testJournalConversion()
6942PASS : KCalConversionTest::testContactConversion()
6943PASS : KCalConversionTest::testDateTZ()
6944PASS : KCalConversionTest::cleanupTestCase()
6945Totals: 9 passed, 0 failed, 0 skipped
6946********* Finished testing of KCalConversionTest *********
6947********* Start testing of UpgradeTest *********
6948Config: Using QTest library 4.8.5, Qt 4.8.5
6949PASS : UpgradeTest::initTestCase()
6950QDEBUG : UpgradeTest::testIncidence(v2eventSimple) upgradetest(1842) KSystemTimeZonesPrivate::readConfig: readConfig(): local zone= "UTC"
6951QDEBUG : UpgradeTest::testIncidence(v2eventSimple) upgradetest(1842) KSystemTimeZonesPrivate::readZoneTab: readZoneTab( "/usr/share/zoneinfo/zone.tab" )
6952QDEBUG : UpgradeTest::testIncidence(v2eventSimple) upgradetest(1842) UpgradeTest::testIncidence: --------------------------------------------------------
6953QDEBUG : UpgradeTest::testIncidence(v2eventSimple) upgradetest(1842) UpgradeTest::testIncidence: --------------------------------------------------------
6954(14:55:11) mimeutils.cpp(267): ATTACHMENT NAME "akonadi.png" "image/png"
6955(14:55:11) mimeutils.cpp(281): "cid:12709119.4e6If7LLkY@kolab.resource.akonadi"
6956QDEBUG : UpgradeTest::testIncidence(v2eventComplex) upgradetest(1842) UpgradeTest::testIncidence: --------------------------------------------------------
6957QDEBUG : UpgradeTest::testIncidence(v2eventComplex) upgradetest(1842) UpgradeTest::testIncidence: --------------------------------------------------------
6958QDEBUG : UpgradeTest::testIncidence(v2eventAllday) upgradetest(1842) UpgradeTest::testIncidence: --------------------------------------------------------
6959QDEBUG : UpgradeTest::testIncidence(v2eventAllday) upgradetest(1842) UpgradeTest::testIncidence: --------------------------------------------------------
6960(14:55:11) mimeutils.cpp(267): ATTACHMENT NAME "AkonadiIcon" "image/png"
6961(14:55:11) mimeutils.cpp(281): "cid:1493002.xnNOM2xAA5@kolab.resource.akonadi"
6962QDEBUG : UpgradeTest::testIncidence(v2eventAttachment) upgradetest(1842) UpgradeTest::testIncidence: --------------------------------------------------------
6963QDEBUG : UpgradeTest::testIncidence(v2eventAttachment) upgradetest(1842) UpgradeTest::testIncidence: --------------------------------------------------------
6964QDEBUG : UpgradeTest::testIncidence(v2eventHorde) upgradetest(1842) KolabV2::KolabBase::loadEmailAttribute: Warning: Unhandled tag "uid"
6965QDEBUG : UpgradeTest::testIncidence(v2eventHorde) upgradetest(1842) UpgradeTest::testIncidence: --------------------------------------------------------
6966QDEBUG : UpgradeTest::testIncidence(v2eventHorde) upgradetest(1842) UpgradeTest::testIncidence: --------------------------------------------------------
6967QDEBUG : UpgradeTest::testIncidence(v2taskSimple) upgradetest(1842) UpgradeTest::testIncidence: --------------------------------------------------------
6968QDEBUG : UpgradeTest::testIncidence(v2taskSimple) upgradetest(1842) UpgradeTest::testIncidence: --------------------------------------------------------
6969(14:55:11) mimeutils.cpp(267): ATTACHMENT NAME "akonadi.png" "image/png"
6970(14:55:11) mimeutils.cpp(281): "cid:7858492.17SmHzbdIx@kolab.resource.akonadi"
6971QDEBUG : UpgradeTest::testIncidence(v2taskComplex) upgradetest(1842) UpgradeTest::testIncidence: --------------------------------------------------------
6972QDEBUG : UpgradeTest::testIncidence(v2taskComplex) upgradetest(1842) UpgradeTest::testIncidence: --------------------------------------------------------
6973QDEBUG : UpgradeTest::testIncidence(v2taskPrio1) upgradetest(1842) UpgradeTest::testIncidence: --------------------------------------------------------
6974QDEBUG : UpgradeTest::testIncidence(v2taskPrio1) upgradetest(1842) UpgradeTest::testIncidence: --------------------------------------------------------
6975QDEBUG : UpgradeTest::testIncidence(v2taskPrio2) upgradetest(1842) UpgradeTest::testIncidence: --------------------------------------------------------
6976QDEBUG : UpgradeTest::testIncidence(v2taskPrio2) upgradetest(1842) UpgradeTest::testIncidence: --------------------------------------------------------
6977QDEBUG : UpgradeTest::testIncidence(v2journalSimple) upgradetest(1842) UpgradeTest::testIncidence: --------------------------------------------------------
6978QDEBUG : UpgradeTest::testIncidence(v2journalSimple) upgradetest(1842) UpgradeTest::testIncidence: --------------------------------------------------------
6979QDEBUG : UpgradeTest::testIncidence(v2journalComplex) upgradetest(1842) UpgradeTest::testIncidence: --------------------------------------------------------
6980QDEBUG : UpgradeTest::testIncidence(v2journalComplex) upgradetest(1842) UpgradeTest::testIncidence: --------------------------------------------------------
6981QDEBUG : UpgradeTest::testIncidence(v2eventSimple_missingTypeHeader) upgradetest(1842) UpgradeTest::testIncidence: --------------------------------------------------------
6982QDEBUG : UpgradeTest::testIncidence(v2eventSimple_missingTypeHeader) upgradetest(1842) UpgradeTest::testIncidence: --------------------------------------------------------
6983QDEBUG : UpgradeTest::testIncidence(v2eventis8859-1) upgradetest(1842) UpgradeTest::testIncidence: --------------------------------------------------------
6984QDEBUG : UpgradeTest::testIncidence(v2eventis8859-1) upgradetest(1842) UpgradeTest::testIncidence: --------------------------------------------------------
6985PASS : UpgradeTest::testIncidence()
6986(14:55:11) kabcconversion.cpp(631): "Department" "Department" "Department"
6987(14:55:11) kabcconversion.cpp(829): sound is not supported
6988(14:55:11) kabcconversion.cpp(631): "Department" "Department" "Department"
6989(14:55:12) kabcconversion.cpp(631): "fr test" "fr test" "fr test"
6990PASS : UpgradeTest::testContact()
6991PASS : UpgradeTest::cleanupTestCase()
6992Totals: 4 passed, 0 failed, 0 skipped
6993********* Finished testing of UpgradeTest *********
6994/srv/libkolab.git/build /srv/libkolab.git
6995FAILED tests.
6996FAILED tests.
6997Running ../stick.git/drydocker/libkolab/test_unit.sh FAILED (at 65aaf8504a5fd0bc6775ef52686bf1c8a9e3b5bb)
6998========================================================================
6999 Running '../stick.git/drydocker/libkolab/test_build.sh' OK (at 65aaf8504a5fd0bc6775ef52686bf1c8a9e3b5bb)
7000 Running '../stick.git/drydocker/libkolab/test_unit.sh' FAILED (at 65aaf8504a5fd0bc6775ef52686bf1c8a9e3b5bb)
7001========================================================================
7002/var/drydock/workingcopy-215935/repo/libkolab
7003

Lease Working Copy

When
Completed at Apr 22 2016, 4:44 PM · Built for 1 s
Status
Passed

Wait for Previous Commits to Build

When
Completed at Apr 22 2016, 4:44 PM · Built for 1 s
Status
Passed

Event Timeline