Page MenuHomekolab.org

Build 3418

Drydock: Run Command

When
Completed at Apr 22 2016, 4:55 PM · Built for 10 m, 32 s
Status
Failed

Build Log 10430 (remote - stderr)
25 - 50 - 100 - Unlimited Lines

81Switched to a new branch 'libkolab-0.4'
82Switched to a new branch 'libkolab-0.5'
83Switched to a new branch 'libkolab-0.6'
84Switched to a new branch 'libkolab-0.7'
85Switched to a new branch 'libkolab-1.0'
86Switched to branch 'master'
87Switched to a new branch 'mimeobject'
88Switched to a new branch 'timezones'
89Note: checking out '65aaf8504a5fd0bc6775ef52686bf1c8a9e3b5bb'.
90
91You are in 'detached HEAD' state. You can look around, make experimental
92changes and commit them, and you can discard any commits you make in this
93state without impacting any branches by performing another checkout.
94
95If you want to create a new branch to retain commits you create, you may
96do so (now or later) by using -b with the checkout command again. Example:
97
98 git checkout -b new_branch_name
99
100HEAD is now at 65aaf85... Intercept debug messages when building with libcalendaring.
101+ exit 1
102+ retval=1
103+ popd
104+ exit 1
105

Build Log 10429 (remote - stdout)
25 - 50 - 100 - Unlimited Lines

6979QDEBUG : UpgradeTest::testIncidence(v2journalComplex) upgradetest(1842) UpgradeTest::testIncidence: --------------------------------------------------------
6980QDEBUG : UpgradeTest::testIncidence(v2journalComplex) upgradetest(1842) UpgradeTest::testIncidence: --------------------------------------------------------
6981QDEBUG : UpgradeTest::testIncidence(v2eventSimple_missingTypeHeader) upgradetest(1842) UpgradeTest::testIncidence: --------------------------------------------------------
6982QDEBUG : UpgradeTest::testIncidence(v2eventSimple_missingTypeHeader) upgradetest(1842) UpgradeTest::testIncidence: --------------------------------------------------------
6983QDEBUG : UpgradeTest::testIncidence(v2eventis8859-1) upgradetest(1842) UpgradeTest::testIncidence: --------------------------------------------------------
6984QDEBUG : UpgradeTest::testIncidence(v2eventis8859-1) upgradetest(1842) UpgradeTest::testIncidence: --------------------------------------------------------
6985PASS : UpgradeTest::testIncidence()
6986(14:55:11) kabcconversion.cpp(631): "Department" "Department" "Department"
6987(14:55:11) kabcconversion.cpp(829): sound is not supported
6988(14:55:11) kabcconversion.cpp(631): "Department" "Department" "Department"
6989(14:55:12) kabcconversion.cpp(631): "fr test" "fr test" "fr test"
6990PASS : UpgradeTest::testContact()
6991PASS : UpgradeTest::cleanupTestCase()
6992Totals: 4 passed, 0 failed, 0 skipped
6993********* Finished testing of UpgradeTest *********
6994/srv/libkolab.git/build /srv/libkolab.git
6995FAILED tests.
6996FAILED tests.
6997Running ../stick.git/drydocker/libkolab/test_unit.sh FAILED (at 65aaf8504a5fd0bc6775ef52686bf1c8a9e3b5bb)
6998========================================================================
6999 Running '../stick.git/drydocker/libkolab/test_build.sh' OK (at 65aaf8504a5fd0bc6775ef52686bf1c8a9e3b5bb)
7000 Running '../stick.git/drydocker/libkolab/test_unit.sh' FAILED (at 65aaf8504a5fd0bc6775ef52686bf1c8a9e3b5bb)
7001========================================================================
7002/var/drydock/workingcopy-215935/repo/libkolab
7003

Lease Working Copy

When
Completed at Apr 22 2016, 4:44 PM · Built for 1 s
Status
Passed

Wait for Previous Commits to Build

When
Completed at Apr 22 2016, 4:44 PM · Built for 1 s
Status
Passed

Event Timeline