Page MenuHomekolab.org

Build 3277

Drydock: Run Command

When
Completed at Apr 6 2016, 5:52 PM · Built for 7 m, 23 s
Status
Failed

Build Log 10182 (remote - stderr)
25 - 50 - 100 - Unlimited Lines

89To address this issue please refer to the below knowledge base article
90
91https://access.redhat.com/articles/1320623
92
93If above article doesn't help to resolve this issue please create a bug on https://bugs.centos.org/
94
95http://download.fedoraproject.org/pub/epel/7/x86_64/repodata/b37fd29a88a3a6c734444c16072319f3ddbea57c34ac1a42df4f4cd27eaaee6d-primary.sqlite.xz: [Errno 14] HTTP Error 404 - Not Found
96Trying other mirror.
97Note: checking out 'dcad55ab64abb15d692db4d70a3e70b89b789e2f'.
98
99You are in 'detached HEAD' state. You can look around, make experimental
100changes and commit them, and you can discard any commits you make in this
101state without impacting any branches by performing another checkout.
102
103If you want to create a new branch to retain commits you create, you may
104do so (now or later) by using -b with the checkout command again. Example:
105
106 git checkout -b new_branch_name
107
108HEAD is now at dcad55a... Prepare release of libkolab-0.6.2
109+ exit 1
110+ retval=1
111+ popd
112+ exit 1
113

Build Log 10181 (remote - stdout)
25 - 50 - 100 - Unlimited Lines

6957QDEBUG : UpgradeTest::testIncidence(v2journalComplex) upgradetest(1844) UpgradeTest::testIncidence: --------------------------------------------------------
6958QDEBUG : UpgradeTest::testIncidence(v2journalComplex) upgradetest(1844) UpgradeTest::testIncidence: --------------------------------------------------------
6959QDEBUG : UpgradeTest::testIncidence(v2eventSimple_missingTypeHeader) upgradetest(1844) UpgradeTest::testIncidence: --------------------------------------------------------
6960QDEBUG : UpgradeTest::testIncidence(v2eventSimple_missingTypeHeader) upgradetest(1844) UpgradeTest::testIncidence: --------------------------------------------------------
6961QDEBUG : UpgradeTest::testIncidence(v2eventis8859-1) upgradetest(1844) UpgradeTest::testIncidence: --------------------------------------------------------
6962QDEBUG : UpgradeTest::testIncidence(v2eventis8859-1) upgradetest(1844) UpgradeTest::testIncidence: --------------------------------------------------------
6963PASS : UpgradeTest::testIncidence()
6964(15:52:48) kabcconversion.cpp(631): "Department" "Department" "Department"
6965(15:52:48) kabcconversion.cpp(829): sound is not supported
6966(15:52:48) kabcconversion.cpp(631): "Department" "Department" "Department"
6967(15:52:48) kabcconversion.cpp(631): "fr test" "fr test" "fr test"
6968PASS : UpgradeTest::testContact()
6969PASS : UpgradeTest::cleanupTestCase()
6970Totals: 4 passed, 0 failed, 0 skipped
6971********* Finished testing of UpgradeTest *********
6972/srv/libkolab.git/build /srv/libkolab.git
6973FAILED tests.
6974FAILED tests.
6975Running ../stick.git/drydocker/libkolab/test_unit.sh FAILED (at dcad55ab64abb15d692db4d70a3e70b89b789e2f)
6976========================================================================
6977 Running '../stick.git/drydocker/libkolab/test_build.sh' OK (at dcad55ab64abb15d692db4d70a3e70b89b789e2f)
6978 Running '../stick.git/drydocker/libkolab/test_unit.sh' FAILED (at dcad55ab64abb15d692db4d70a3e70b89b789e2f)
6979========================================================================
6980/var/drydock/workingcopy-215934/repo/libkolab
6981

Lease Working Copy

When
Completed at Apr 6 2016, 5:45 PM · Built instantly
Status
Passed

Wait for Previous Commits to Build

When
Completed at Apr 6 2016, 5:45 PM · Built instantly
Status
Passed

Event Timeline