Page MenuHomekolab.org

Build 3248

Drydock: Run Command

When
Completed at Apr 4 2016, 4:49 PM · Built for 1 m, 58 s
Status
Failed

Build Log 10138 (remote - stderr)
25 - 50 - 100 - Unlimited Lines

75do so (now or later) by using -b with the checkout command again. Example:
76
77 git checkout -b new_branch_name
78
79HEAD is now at a35735a... 0.5.14
80Previous HEAD position was a35735a... 0.5.14
81Switched to a new branch 'pykolab-0.6'
82Switched to a new branch 'pykolab-0.7'
83Note: checking out 'ec6b2d60c2bc8253c83a62218c90563c1850975c'.
84
85You are in 'detached HEAD' state. You can look around, make experimental
86changes and commit them, and you can discard any commits you make in this
87state without impacting any branches by performing another checkout.
88
89If you want to create a new branch to retain commits you create, you may
90do so (now or later) by using -b with the checkout command again. Example:
91
92 git checkout -b new_branch_name
93
94HEAD is now at ec6b2d6... Remove libkolab and libcalendaring from plugins list
95+ exit 1
96+ retval=1
97+ popd
98+ exit 1
99

Build Log 10137 (remote - stdout)
25 - 50 - 100 - Unlimited Lines

1452----------------------------------------------------------------------
1453Traceback (most recent call last):
1454 File "/srv/pykolab.git/tests/unit/test-010-transliterate.py", line 45, in test_003_raw_es_ES
1455 self.assertEqual('Alvaro', utils.translate(givenname, preferredlanguage))
1456AssertionError: 'Alvaro' != u'\xc1lvaro'
1457
1458======================================================================
1459FAIL: The special thing about this case is that the givenname starts with
1460----------------------------------------------------------------------
1461Traceback (most recent call last):
1462 File "/srv/pykolab.git/tests/unit/test-010-transliterate.py", line 59, in test_004_unicode_es_ES
1463 self.assertEqual('Alvaro', utils.translate(givenname, preferredlanguage))
1464AssertionError: 'Alvaro' != u'\xc1lvaro'
1465
1466----------------------------------------------------------------------
1467Ran 140 tests in 2.928s
1468
1469FAILED (SKIP=1, errors=9, failures=4)
1470Running ../stick.git/drydocker/pykolab/test_unit.sh FAILED (at ec6b2d60c2bc8253c83a62218c90563c1850975c)
1471========================================================================
1472 Running '../stick.git/drydocker/pykolab/test_build.sh' OK (at ec6b2d60c2bc8253c83a62218c90563c1850975c)
1473 Running '../stick.git/drydocker/pykolab/test_unit.sh' FAILED (at ec6b2d60c2bc8253c83a62218c90563c1850975c)
1474========================================================================
1475/var/drydock/workingcopy-215829/repo/pykolab
1476

Lease Working Copy

When
Completed at Apr 4 2016, 4:47 PM · Built instantly
Status
Passed

Wait for Previous Commits to Build

When
Completed at Apr 4 2016, 4:47 PM · Built instantly
Status
Passed

Event Timeline