Page MenuHomekolab.org

Build 3243

Drydock: Run Command

When
Completed at Apr 4 2016, 4:40 PM · Built for 1 m, 33 s
Status
Failed

Build Log 10122 (remote - stderr)
25 - 50 - 100 - Unlimited Lines

51+ export test_obs
52+ '[' '!' -d /var/tmp/osbuild-packagecache ']'
53+ '[' -x stick.git/drydocker/pykolab/build.sh ']'
54+ pushd pykolab.git
55+ ../stick.git/drydocker/pykolab/build.sh
56+ docker run -i --attach=stdout --attach=stderr --detach=false --rm=true --volume=/root/.oscrc:/root/.oscrc --volume=/var/tmp/osbuild-packagecache/:/var/tmp/osbuild-packagecache/ --hostname=kolab.example.org -e ID=3243 -e COMMIT=be3b581250f459b661c6e18072b7e9298475c504 -e DIFFERENTIAL= -e PACKAGE=pykolab -e PHAB_CERT= -e PHAB_USER= -e PHID=PHID-HMBT-q2zo2fmkqltfbrcmglo3 -e URI=ssh://git@git.kolab.org/diffusion/P/pykolab.git -e RO_URI=https://git.kolab.org/diffusion/P/pykolab.git -e VCS=git -e TEST_BUILD=1 -e TEST_FUNCTIONAL=1 -e TEST_INTEGRATION=1 -e TEST_PERFORMANCE=1 -e TEST_UNIT=1 -e TEST_OBS=1 kolab/ci-maipo
57Switched to a new branch 'dev/boddie'
58Switched to a new branch 'dev/boddie-new/combined'
59Switched to a new branch 'dev/boddie-new/setup'
60Switched to a new branch 'dev/confmgmt'
61Switched to a new branch 'dev/entitlements'
62Switched to a new branch 'dev/kolab-test-suite'
63Switched to a new branch 'dev/kolab-test-tools'
64Switched to branch 'master'
65Switched to a new branch 'pykolab-0.2'
66Switched to a new branch 'pykolab-0.3'
67Switched to a new branch 'pykolab-0.4'
68Switched to a new branch 'pykolab-0.5'
69Note: checking out 'pykolab-0.5.14'.
70
71You are in 'detached HEAD' state. You can look around, make experimental
72changes and commit them, and you can discard any commits you make in this
73state without impacting any branches by performing another checkout.
74
75If you want to create a new branch to retain commits you create, you may
76do so (now or later) by using -b with the checkout command again. Example:
77
78 git checkout -b new_branch_name
79
80HEAD is now at a35735a... 0.5.14
81Previous HEAD position was a35735a... 0.5.14
82Switched to a new branch 'pykolab-0.6'
83Switched to a new branch 'pykolab-0.7'
84Note: checking out 'be3b581250f459b661c6e18072b7e9298475c504'.
85
86You are in 'detached HEAD' state. You can look around, make experimental
87changes and commit them, and you can discard any commits you make in this
88state without impacting any branches by performing another checkout.
89
90If you want to create a new branch to retain commits you create, you may
91do so (now or later) by using -b with the checkout command again. Example:
92
93 git checkout -b new_branch_name
94
95HEAD is now at be3b581... Respect content encoding of the message part when adding a footer (#5087)
96+ exit 1
97+ retval=1
98+ popd
99+ exit 1
100

Build Log 10121 (remote - stdout)
25 - 50 - 100 - Unlimited Lines

1260 return self.importFromDir(dir_path, fqname)
1261 File "/usr/lib/python2.7/site-packages/nose/importer.py", line 94, in importFromDir
1262 mod = load_module(part_fqname, fh, filename, desc)
1263 File "/srv/pykolab.git/tests/unit/test-012-wallace_invitationpolicy.py", line 12, in <module>
1264 from twisted.trial import unittest
1265ImportError: No module named twisted.trial
1266
1267======================================================================
1268FAIL: The special thing about this case is that the givenname starts with
1269----------------------------------------------------------------------
1270Traceback (most recent call last):
1271 File "/srv/pykolab.git/tests/unit/test-010-transliterate.py", line 17, in test_001_raw_fr_FR
1272 self.assertEqual('Etienne-Nicolas', utils.translate(givenname, preferredlanguage))
1273AssertionError: 'Etienne-Nicolas' != u'\xc9tienne-Nicolas'
1274
1275======================================================================
1276FAIL: The special thing about this case is that the givenname starts with
1277----------------------------------------------------------------------
1278Traceback (most recent call last):
1279 File "/srv/pykolab.git/tests/unit/test-010-transliterate.py", line 31, in test_002_unicode_fr_FR
1280 self.assertEqual('Etienne-Nicolas', utils.translate(givenname, preferredlanguage))
1281AssertionError: 'Etienne-Nicolas' != u'\xc9tienne-Nicolas'
1282
1283======================================================================
1284FAIL: The special thing about this case is that the givenname starts with
1285----------------------------------------------------------------------
1286Traceback (most recent call last):
1287 File "/srv/pykolab.git/tests/unit/test-010-transliterate.py", line 45, in test_003_raw_es_ES
1288 self.assertEqual('Alvaro', utils.translate(givenname, preferredlanguage))
1289AssertionError: 'Alvaro' != u'\xc1lvaro'
1290
1291======================================================================
1292FAIL: The special thing about this case is that the givenname starts with
1293----------------------------------------------------------------------
1294Traceback (most recent call last):
1295 File "/srv/pykolab.git/tests/unit/test-010-transliterate.py", line 59, in test_004_unicode_es_ES
1296 self.assertEqual('Alvaro', utils.translate(givenname, preferredlanguage))
1297AssertionError: 'Alvaro' != u'\xc1lvaro'
1298
1299----------------------------------------------------------------------
1300Ran 124 tests in 0.662s
1301
1302FAILED (SKIP=1, errors=13, failures=4)
1303Running ../stick.git/drydocker/pykolab/test_unit.sh FAILED (at be3b581250f459b661c6e18072b7e9298475c504)
1304========================================================================
1305 Running '../stick.git/drydocker/pykolab/test_build.sh' OK (at be3b581250f459b661c6e18072b7e9298475c504)
1306 Running '../stick.git/drydocker/pykolab/test_unit.sh' FAILED (at be3b581250f459b661c6e18072b7e9298475c504)
1307========================================================================
1308/var/drydock/workingcopy-67/repo/pykolab
1309

Lease Working Copy

When
Completed at Apr 4 2016, 4:38 PM · Built instantly
Status
Passed

Wait for Previous Commits to Build

When
Completed at Apr 4 2016, 4:38 PM · Built instantly
Status
Passed

Event Timeline