Page MenuHomekolab.org

Build 3243

Drydock: Run Command

When
Completed at Apr 4 2016, 4:40 PM · Built for 1 m, 33 s
Status
Failed

Build Log 10122 (remote - stderr)
25 - 50 - 100 - Unlimited Lines

1+ '[' -z be3b581250f459b661c6e18072b7e9298475c504 -a -z '' ']'
2+ '[' -z ssh://git@git.kolab.org/diffusion/P/pykolab.git ']'
3+ '[' 0 -eq 0 -a 0 -eq 0 -a 0 -eq 0 -a 0 -eq 0 -a 0 -eq 0 -a 0 -eq 0 ']'
4+ test_build=1
5+ test_functional=1
6+ test_integration=1
7+ test_performance=1
8+ test_unit=1
9+ test_obs=1
10+ '[' -z git ']'
11+ case ${vcs} in
12++ basename ssh://git@git.kolab.org/diffusion/P/pykolab.git .git
13+ package=pykolab
14++ echo ssh://git@git.kolab.org/diffusion/P/pykolab.git
15++ sed -e 's|ssh://git@|https://|g'
16+ ro_uri=https://git.kolab.org/diffusion/P/pykolab.git
17+ case ${package} in
18++ pwd
19+ export TMPDIR=/var/drydock/workingcopy-67/repo/pykolab
20+ TMPDIR=/var/drydock/workingcopy-67/repo/pykolab
21+ '[' '!' -d pykolab.git ']'
22+ pushd pykolab.git
23+ git remote set-url origin https://git.kolab.org/diffusion/P/pykolab.git
24+ git fetch origin
25+ git reset --hard origin/master
26+ git clean -d -f -x
27+ git checkout be3b581250f459b661c6e18072b7e9298475c504
28Previous HEAD position was ec6b2d6... Remove libkolab and libcalendaring from plugins list
29HEAD is now at be3b581... Respect content encoding of the message part when adding a footer (#5087)
30+ popd
31+ '[' pykolab '!=' stick ']'
32+ '[' '!' -d stick.git ']'
33+ pushd stick.git
34+ git remote set-url origin https://git.kolab.org/diffusion/QA/stick.git
35+ git fetch origin
36+ git reset --hard origin/master
37+ git clean -d -f -x
38+ popd
39+ export commit
40+ export differential
41+ export id
42+ export package
43+ export phid
44+ export ro_uri
45+ export uri
46+ export vcs
47+ export test_build
48+ export test_functional
49+ export test_integration
50+ export test_performance
51+ export test_unit
52+ export test_obs
53+ '[' '!' -d /var/tmp/osbuild-packagecache ']'
54+ '[' -x stick.git/drydocker/pykolab/build.sh ']'
55+ pushd pykolab.git
56+ ../stick.git/drydocker/pykolab/build.sh
57+ docker run -i --attach=stdout --attach=stderr --detach=false --rm=true --volume=/root/.oscrc:/root/.oscrc --volume=/var/tmp/osbuild-packagecache/:/var/tmp/osbuild-packagecache/ --hostname=kolab.example.org -e ID=3243 -e COMMIT=be3b581250f459b661c6e18072b7e9298475c504 -e DIFFERENTIAL= -e PACKAGE=pykolab -e PHAB_CERT= -e PHAB_USER= -e PHID=PHID-HMBT-q2zo2fmkqltfbrcmglo3 -e URI=ssh://git@git.kolab.org/diffusion/P/pykolab.git -e RO_URI=https://git.kolab.org/diffusion/P/pykolab.git -e VCS=git -e TEST_BUILD=1 -e TEST_FUNCTIONAL=1 -e TEST_INTEGRATION=1 -e TEST_PERFORMANCE=1 -e TEST_UNIT=1 -e TEST_OBS=1 kolab/ci-maipo
58Switched to a new branch 'dev/boddie'
59Switched to a new branch 'dev/boddie-new/combined'
60Switched to a new branch 'dev/boddie-new/setup'
61Switched to a new branch 'dev/confmgmt'
62Switched to a new branch 'dev/entitlements'
63Switched to a new branch 'dev/kolab-test-suite'
64Switched to a new branch 'dev/kolab-test-tools'
65Switched to branch 'master'
66Switched to a new branch 'pykolab-0.2'
67Switched to a new branch 'pykolab-0.3'
68Switched to a new branch 'pykolab-0.4'
69Switched to a new branch 'pykolab-0.5'
70Note: checking out 'pykolab-0.5.14'.
71
72You are in 'detached HEAD' state. You can look around, make experimental
73changes and commit them, and you can discard any commits you make in this
74state without impacting any branches by performing another checkout.
75
76If you want to create a new branch to retain commits you create, you may
77do so (now or later) by using -b with the checkout command again. Example:
78
79 git checkout -b new_branch_name
80
81HEAD is now at a35735a... 0.5.14
82Previous HEAD position was a35735a... 0.5.14
83Switched to a new branch 'pykolab-0.6'
84Switched to a new branch 'pykolab-0.7'
85Note: checking out 'be3b581250f459b661c6e18072b7e9298475c504'.
86
87You are in 'detached HEAD' state. You can look around, make experimental
88changes and commit them, and you can discard any commits you make in this
89state without impacting any branches by performing another checkout.
90
91If you want to create a new branch to retain commits you create, you may
92do so (now or later) by using -b with the checkout command again. Example:
93
94 git checkout -b new_branch_name
95
96HEAD is now at be3b581... Respect content encoding of the message part when adding a footer (#5087)
97+ exit 1
98+ retval=1
99+ popd
100+ exit 1
101

Build Log 10121 (remote - stdout)
25 - 50 - 100 - Unlimited Lines

1/var/drydock/workingcopy-67/repo/pykolab/pykolab.git /var/drydock/workingcopy-67/repo/pykolab
2HEAD is now at ec6b2d6 Remove libkolab and libcalendaring from plugins list
3/var/drydock/workingcopy-67/repo/pykolab
4/var/drydock/workingcopy-67/repo/pykolab/stick.git /var/drydock/workingcopy-67/repo/pykolab
5HEAD is now at 7205806 Add a kickstart to provision a phoenix system
6/var/drydock/workingcopy-67/repo/pykolab
7/var/drydock/workingcopy-67/repo/pykolab/pykolab.git /var/drydock/workingcopy-67/repo/pykolab
8Cloning into '/srv/stick.git'...
9Cloning into '/srv/pykolab.git'...
10/srv/pykolab.git /srv/closure-compiler.git
11Branch dev/boddie set up to track remote branch dev/boddie from origin.
12Branch dev/boddie-new/combined set up to track remote branch dev/boddie-new/combined from origin.
13Branch dev/boddie-new/setup set up to track remote branch dev/boddie-new/setup from origin.
14Branch dev/confmgmt set up to track remote branch dev/confmgmt from origin.
15Branch dev/entitlements set up to track remote branch dev/entitlements from origin.
16Branch dev/kolab-test-suite set up to track remote branch dev/kolab-test-suite from origin.
17Branch dev/kolab-test-tools set up to track remote branch dev/kolab-test-tools from origin.
18Branch pykolab-0.2 set up to track remote branch pykolab-0.2 from origin.
19Branch pykolab-0.3 set up to track remote branch pykolab-0.3 from origin.
20Branch pykolab-0.4 set up to track remote branch pykolab-0.4 from origin.
21Branch pykolab-0.5 set up to track remote branch pykolab-0.5 from origin.
22Branch pykolab-0.6 set up to track remote branch pykolab-0.6 from origin.
23Branch pykolab-0.7 set up to track remote branch pykolab-0.7 from origin.
24/srv/closure-compiler.git
25Loaded plugins: ovl, priorities
26Cleaning repos: Kolab_16 Kolab_3.4 Kolab_3.4_Updates Kolab_Winterfell base epel
27 : extras openSUSE_Tools updates
280 metadata files removed
290 sqlite files removed
300 metadata files removed
31Loaded plugins: ovl, priorities
32152 packages excluded due to repository priority protections
33Resolving Dependencies
34--> Running transaction check
35---> Package bind-libs.x86_64 32:9.9.4-29.el7_2.2 will be updated
36---> Package bind-libs.x86_64 32:9.9.4-29.el7_2.3 will be an update
37---> Package bind-license.noarch 32:9.9.4-29.el7_2.2 will be updated
38---> Package bind-license.noarch 32:9.9.4-29.el7_2.3 will be an update
39---> Package bind-utils.x86_64 32:9.9.4-29.el7_2.2 will be updated
40---> Package bind-utils.x86_64 32:9.9.4-29.el7_2.3 will be an update
41---> Package epel-rpm-macros.noarch 0:7-6 will be updated
42---> Package epel-rpm-macros.noarch 0:7-7 will be an update
43---> Package git.x86_64 0:1.8.3.1-6.el7 will be updated
44---> Package git.x86_64 0:1.8.3.1-6.el7_2.1 will be an update
45---> Package java-1.7.0-openjdk.x86_64 1:1.7.0.95-2.6.4.0.el7_2 will be updated
46---> Package java-1.7.0-openjdk.x86_64 1:1.7.0.99-2.6.5.0.el7_2 will be an update
47---> Package java-1.7.0-openjdk-devel.x86_64 1:1.7.0.95-2.6.4.0.el7_2 will be updated
48---> Package java-1.7.0-openjdk-devel.x86_64 1:1.7.0.99-2.6.5.0.el7_2 will be an update
49---> Package java-1.7.0-openjdk-headless.x86_64 1:1.7.0.95-2.6.4.0.el7_2 will be updated
50---> Package java-1.7.0-openjdk-headless.x86_64 1:1.7.0.99-2.6.5.0.el7_2 will be an update
51---> Package kernel-headers.x86_64 0:3.10.0-327.10.1.el7 will be updated
52---> Package kernel-headers.x86_64 0:3.10.0-327.13.1.el7 will be an update
53---> Package kpartx.x86_64 0:0.4.9-85.el7 will be updated
54---> Package kpartx.x86_64 0:0.4.9-85.el7_2.1 will be an update
55---> Package krb5-libs.x86_64 0:1.13.2-10.el7 will be updated
56---> Package krb5-libs.x86_64 0:1.13.2-12.el7_2 will be an update
57---> Package libblkid.x86_64 0:2.23.2-26.el7 will be updated
58---> Package libblkid.x86_64 0:2.23.2-26.el7_2.2 will be an update
59---> Package libmount.x86_64 0:2.23.2-26.el7 will be updated
60---> Package libmount.x86_64 0:2.23.2-26.el7_2.2 will be an update
61---> Package libssh2.x86_64 0:1.4.3-10.el7 will be updated
62---> Package libssh2.x86_64 0:1.4.3-10.el7_2.1 will be an update
63---> Package libuuid.x86_64 0:2.23.2-26.el7 will be updated
64---> Package libuuid.x86_64 0:2.23.2-26.el7_2.2 will be an update
65---> Package nss-util.x86_64 0:3.19.1-4.el7_1 will be updated
66---> Package nss-util.x86_64 0:3.19.1-9.el7_2 will be an update
67---> Package openldap.x86_64 0:2.4.40-8.el7 will be updated
68---> Package openldap.x86_64 0:2.4.40-9.el7_2 will be an update
69---> Package openldap-clients.x86_64 0:2.4.40-8.el7 will be updated
70---> Package openldap-clients.x86_64 0:2.4.40-9.el7_2 will be an update
71---> Package openssh.x86_64 0:6.6.1p1-23.el7_2 will be updated
72---> Package openssh.x86_64 0:6.6.1p1-25.el7_2 will be an update
73---> Package openssh-clients.x86_64 0:6.6.1p1-23.el7_2 will be updated
74---> Package openssh-clients.x86_64 0:6.6.1p1-25.el7_2 will be an update
75---> Package osc.x86_64 0:0.153.0-175.1 will be updated
76---> Package osc.x86_64 0:0.153.0-177.1 will be an update
77---> Package perl-Git.noarch 0:1.8.3.1-6.el7 will be updated
78---> Package perl-Git.noarch 0:1.8.3.1-6.el7_2.1 will be an update
79---> Package php-phpunit-PHPUnit.noarch 0:4.8.23-1.el7 will be updated
80---> Package php-phpunit-PHPUnit.noarch 0:4.8.24-1.el7 will be an update
81---> Package php-symfony-class-loader.noarch 0:2.7.9-2.el7 will be updated
82---> Package php-symfony-class-loader.noarch 0:2.7.10-1.el7 will be an update
83---> Package php-symfony-common.noarch 0:2.7.9-2.el7 will be updated
84---> Package php-symfony-common.noarch 0:2.7.10-1.el7 will be an update
85---> Package php-symfony-yaml.noarch 0:2.7.9-2.el7 will be updated
86---> Package php-symfony-yaml.noarch 0:2.7.10-1.el7 will be an update
87---> Package php-tidy.x86_64 0:5.4.16-3.el7 will be updated
88---> Package php-tidy.x86_64 0:5.4.16-4.el7 will be an update
89---> Package sudo.x86_64 0:1.8.6p7-16.el7 will be updated
90---> Package sudo.x86_64 0:1.8.6p7-17.el7_2 will be an update
91---> Package systemd.x86_64 0:219-19.el7_2.4 will be updated
92---> Package systemd.x86_64 0:219-19.el7_2.7 will be an update
93---> Package systemd-libs.x86_64 0:219-19.el7_2.4 will be updated
94---> Package systemd-libs.x86_64 0:219-19.el7_2.7 will be an update
95---> Package tzdata.noarch 0:2016a-1.el7 will be updated
96---> Package tzdata.noarch 0:2016c-1.el7 will be an update
97---> Package tzdata-java.noarch 0:2016a-1.el7 will be updated
98---> Package tzdata-java.noarch 0:2016c-1.el7 will be an update
99---> Package util-linux.x86_64 0:2.23.2-26.el7 will be updated
100---> Package util-linux.x86_64 0:2.23.2-26.el7_2.2 will be an update
101--> Finished Dependency Resolution
102
103Dependencies Resolved
104
105================================================================================
106 Package Arch Version Repository Size
107================================================================================
108Updating:
109 bind-libs x86_64 32:9.9.4-29.el7_2.3 updates 1.0 M
110 bind-license noarch 32:9.9.4-29.el7_2.3 updates 82 k
111 bind-utils x86_64 32:9.9.4-29.el7_2.3 updates 200 k
112 epel-rpm-macros noarch 7-7 epel 11 k
113 git x86_64 1.8.3.1-6.el7_2.1 updates 4.4 M
114 java-1.7.0-openjdk x86_64 1:1.7.0.99-2.6.5.0.el7_2 updates 207 k
115 java-1.7.0-openjdk-devel x86_64 1:1.7.0.99-2.6.5.0.el7_2 updates 9.2 M
116 java-1.7.0-openjdk-headless
117 x86_64 1:1.7.0.99-2.6.5.0.el7_2 updates 25 M
118 kernel-headers x86_64 3.10.0-327.13.1.el7 updates 3.2 M
119 kpartx x86_64 0.4.9-85.el7_2.1 updates 59 k
120 krb5-libs x86_64 1.13.2-12.el7_2 updates 843 k
121 libblkid x86_64 2.23.2-26.el7_2.2 updates 166 k
122 libmount x86_64 2.23.2-26.el7_2.2 updates 169 k
123 libssh2 x86_64 1.4.3-10.el7_2.1 updates 134 k
124 libuuid x86_64 2.23.2-26.el7_2.2 updates 74 k
125 nss-util x86_64 3.19.1-9.el7_2 updates 71 k
126 openldap x86_64 2.4.40-9.el7_2 updates 348 k
127 openldap-clients x86_64 2.4.40-9.el7_2 updates 186 k
128 openssh x86_64 6.6.1p1-25.el7_2 updates 435 k
129 openssh-clients x86_64 6.6.1p1-25.el7_2 updates 639 k
130 osc x86_64 0.153.0-177.1 openSUSE_Tools 515 k
131 perl-Git noarch 1.8.3.1-6.el7_2.1 updates 53 k
132 php-phpunit-PHPUnit noarch 4.8.24-1.el7 epel 131 k
133 php-symfony-class-loader noarch 2.7.10-1.el7 epel 24 k
134 php-symfony-common noarch 2.7.10-1.el7 epel 104 k
135 php-symfony-yaml noarch 2.7.10-1.el7 epel 26 k
136 php-tidy x86_64 5.4.16-4.el7 epel 22 k
137 sudo x86_64 1.8.6p7-17.el7_2 updates 732 k
138 systemd x86_64 219-19.el7_2.7 updates 5.1 M
139 systemd-libs x86_64 219-19.el7_2.7 updates 357 k
140 tzdata noarch 2016c-1.el7 updates 437 k
141 tzdata-java noarch 2016c-1.el7 updates 178 k
142 util-linux x86_64 2.23.2-26.el7_2.2 updates 1.9 M
143
144Transaction Summary
145================================================================================
146Upgrade 33 Packages
147
148Total download size: 56 M
149Downloading packages:
150Delta RPMs disabled because /usr/bin/applydeltarpm not installed.
151--------------------------------------------------------------------------------
152Total 5.0 MB/s | 56 MB 00:11
153Running transaction check
154Running transaction test
155Transaction test succeeded
156Running transaction
157 Updating : krb5-libs-1.13.2-12.el7_2.x86_64 1/66
158 Updating : libuuid-2.23.2-26.el7_2.2.x86_64 2/66
159 Updating : libblkid-2.23.2-26.el7_2.2.x86_64 3/66
160 Updating : libmount-2.23.2-26.el7_2.2.x86_64 4/66
161 Updating : php-symfony-class-loader-2.7.10-1.el7.noarch 5/66
162 Updating : php-symfony-common-2.7.10-1.el7.noarch 6/66
163 Updating : systemd-libs-219-19.el7_2.7.x86_64 7/66
164 Updating : nss-util-3.19.1-9.el7_2.x86_64 8/66
165 Updating : openldap-2.4.40-9.el7_2.x86_64 9/66
166 Updating : util-linux-2.23.2-26.el7_2.2.x86_64 10/66
167 Updating : openssh-6.6.1p1-25.el7_2.x86_64 11/66
168 Updating : openssh-clients-6.6.1p1-25.el7_2.x86_64 12/66
169 Updating : perl-Git-1.8.3.1-6.el7_2.1.noarch 13/66
170 Updating : git-1.8.3.1-6.el7_2.1.x86_64 14/66
171 Updating : php-symfony-yaml-2.7.10-1.el7.noarch 15/66
172 Updating : tzdata-java-2016c-1.el7.noarch 16/66
173 Updating : 1:java-1.7.0-openjdk-devel-1.7.0.99-2.6.5.0.el7_2.x86_64 17/66
174 Updating : 1:java-1.7.0-openjdk-headless-1.7.0.99-2.6.5.0.el7_2.x86 18/66
175 Updating : 1:java-1.7.0-openjdk-1.7.0.99-2.6.5.0.el7_2.x86_64 19/66
176 Updating : 32:bind-license-9.9.4-29.el7_2.3.noarch 20/66
177 Updating : 32:bind-libs-9.9.4-29.el7_2.3.x86_64 21/66
178 Updating : php-tidy-5.4.16-4.el7.x86_64 22/66
179 Updating : php-phpunit-PHPUnit-4.8.24-1.el7.noarch 23/66
180 Updating : 32:bind-utils-9.9.4-29.el7_2.3.x86_64 24/66
181 Updating : sudo-1.8.6p7-17.el7_2.x86_64 25/66
182 Updating : openldap-clients-2.4.40-9.el7_2.x86_64 26/66
183 Updating : systemd-219-19.el7_2.7.x86_64 27/66
184 Updating : kpartx-0.4.9-85.el7_2.1.x86_64 28/66
185 Updating : kernel-headers-3.10.0-327.13.1.el7.x86_64 29/66
186 Updating : osc-0.153.0-177.1.x86_64 30/66
187 Updating : tzdata-2016c-1.el7.noarch 31/66
188 Updating : epel-rpm-macros-7-7.noarch 32/66
189 Updating : libssh2-1.4.3-10.el7_2.1.x86_64 33/66
190 Cleanup : php-phpunit-PHPUnit-4.8.23-1.el7.noarch 34/66
191 Cleanup : php-symfony-yaml-2.7.9-2.el7.noarch 35/66
192 Cleanup : php-symfony-class-loader-2.7.9-2.el7.noarch 36/66
193 Cleanup : php-symfony-common-2.7.9-2.el7.noarch 37/66
194 Cleanup : git-1.8.3.1-6.el7.x86_64 38/66
195 Cleanup : perl-Git-1.8.3.1-6.el7.noarch 39/66
196 Cleanup : php-tidy-5.4.16-3.el7.x86_64 40/66
197 Cleanup : kernel-headers-3.10.0-327.10.1.el7.x86_64 41/66
198 Cleanup : osc-0.153.0-175.1.x86_64 42/66
199 Cleanup : tzdata-2016a-1.el7.noarch 43/66
200 Cleanup : epel-rpm-macros-7-6.noarch 44/66
201 Cleanup : 32:bind-utils-9.9.4-29.el7_2.2.x86_64 45/66
202 Cleanup : openssh-clients-6.6.1p1-23.el7_2.x86_64 46/66
203 Cleanup : systemd-219-19.el7_2.4.x86_64 47/66
204 Cleanup : openssh-6.6.1p1-23.el7_2.x86_64 48/66
205 Cleanup : util-linux-2.23.2-26.el7.x86_64 49/66
206 Cleanup : libmount-2.23.2-26.el7.x86_64 50/66
207 Cleanup : 32:bind-libs-9.9.4-29.el7_2.2.x86_64 51/66
208 Cleanup : libblkid-2.23.2-26.el7.x86_64 52/66
209 Cleanup : 1:java-1.7.0-openjdk-devel-1.7.0.95-2.6.4.0.el7_2.x86_64 53/66
210 Cleanup : 1:java-1.7.0-openjdk-headless-1.7.0.95-2.6.4.0.el7_2.x86 54/66
211 Cleanup : 1:java-1.7.0-openjdk-1.7.0.95-2.6.4.0.el7_2.x86_64 55/66
212 Cleanup : openldap-clients-2.4.40-8.el7.x86_64 56/66
213 Cleanup : sudo-1.8.6p7-16.el7.x86_64 57/66
214 Cleanup : tzdata-java-2016a-1.el7.noarch 58/66
215 Cleanup : 32:bind-license-9.9.4-29.el7_2.2.noarch 59/66
216 Cleanup : openldap-2.4.40-8.el7.x86_64 60/66
217 Cleanup : nss-util-3.19.1-4.el7_1.x86_64 61/66
218 Cleanup : krb5-libs-1.13.2-10.el7.x86_64 62/66
219 Cleanup : libuuid-2.23.2-26.el7.x86_64 63/66
220 Cleanup : systemd-libs-219-19.el7_2.4.x86_64 64/66
221 Cleanup : kpartx-0.4.9-85.el7.x86_64 65/66
222 Cleanup : libssh2-1.4.3-10.el7.x86_64 66/66
223 Verifying : php-tidy-5.4.16-4.el7.x86_64 1/66
224 Verifying : 1:java-1.7.0-openjdk-1.7.0.99-2.6.5.0.el7_2.x86_64 2/66
225 Verifying : php-phpunit-PHPUnit-4.8.24-1.el7.noarch 3/66
226 Verifying : libssh2-1.4.3-10.el7_2.1.x86_64 4/66
227 Verifying : epel-rpm-macros-7-7.noarch 5/66
228 Verifying : tzdata-2016c-1.el7.noarch 6/66
229 Verifying : libblkid-2.23.2-26.el7_2.2.x86_64 7/66
230 Verifying : 1:java-1.7.0-openjdk-devel-1.7.0.99-2.6.5.0.el7_2.x86_64 8/66
231 Verifying : php-symfony-common-2.7.10-1.el7.noarch 9/66
232 Verifying : 32:bind-license-9.9.4-29.el7_2.3.noarch 10/66
233 Verifying : osc-0.153.0-177.1.x86_64 11/66
234 Verifying : 1:java-1.7.0-openjdk-headless-1.7.0.99-2.6.5.0.el7_2.x86 12/66
235 Verifying : openldap-2.4.40-9.el7_2.x86_64 13/66
236 Verifying : libuuid-2.23.2-26.el7_2.2.x86_64 14/66
237 Verifying : kernel-headers-3.10.0-327.13.1.el7.x86_64 15/66
238 Verifying : sudo-1.8.6p7-17.el7_2.x86_64 16/66
239 Verifying : kpartx-0.4.9-85.el7_2.1.x86_64 17/66
240 Verifying : openssh-6.6.1p1-25.el7_2.x86_64 18/66
241 Verifying : php-symfony-class-loader-2.7.10-1.el7.noarch 19/66
242 Verifying : libmount-2.23.2-26.el7_2.2.x86_64 20/66
243 Verifying : perl-Git-1.8.3.1-6.el7_2.1.noarch 21/66
244 Verifying : 32:bind-libs-9.9.4-29.el7_2.3.x86_64 22/66
245 Verifying : nss-util-3.19.1-9.el7_2.x86_64 23/66
246 Verifying : php-symfony-yaml-2.7.10-1.el7.noarch 24/66
247 Verifying : tzdata-java-2016c-1.el7.noarch 25/66
248 Verifying : openldap-clients-2.4.40-9.el7_2.x86_64 26/66
249 Verifying : systemd-libs-219-19.el7_2.7.x86_64 27/66
250 Verifying : 32:bind-utils-9.9.4-29.el7_2.3.x86_64 28/66
251 Verifying : openssh-clients-6.6.1p1-25.el7_2.x86_64 29/66
252 Verifying : krb5-libs-1.13.2-12.el7_2.x86_64 30/66
253 Verifying : util-linux-2.23.2-26.el7_2.2.x86_64 31/66
254 Verifying : systemd-219-19.el7_2.7.x86_64 32/66
255 Verifying : git-1.8.3.1-6.el7_2.1.x86_64 33/66
256 Verifying : php-tidy-5.4.16-3.el7.x86_64 34/66
257 Verifying : kpartx-0.4.9-85.el7.x86_64 35/66
258 Verifying : osc-0.153.0-175.1.x86_64 36/66
259 Verifying : epel-rpm-macros-7-6.noarch 37/66
260 Verifying : php-symfony-class-loader-2.7.9-2.el7.noarch 38/66
261 Verifying : php-symfony-common-2.7.9-2.el7.noarch 39/66
262 Verifying : 32:bind-libs-9.9.4-29.el7_2.2.x86_64 40/66
263 Verifying : php-phpunit-PHPUnit-4.8.23-1.el7.noarch 41/66
264 Verifying : 32:bind-license-9.9.4-29.el7_2.2.noarch 42/66
265 Verifying : libuuid-2.23.2-26.el7.x86_64 43/66
266 Verifying : systemd-libs-219-19.el7_2.4.x86_64 44/66
267 Verifying : libssh2-1.4.3-10.el7.x86_64 45/66
268 Verifying : systemd-219-19.el7_2.4.x86_64 46/66
269 Verifying : perl-Git-1.8.3.1-6.el7.noarch 47/66
270 Verifying : tzdata-2016a-1.el7.noarch 48/66
271 Verifying : openldap-clients-2.4.40-8.el7.x86_64 49/66
272 Verifying : kernel-headers-3.10.0-327.10.1.el7.x86_64 50/66
273 Verifying : sudo-1.8.6p7-16.el7.x86_64 51/66
274 Verifying : krb5-libs-1.13.2-10.el7.x86_64 52/66
275 Verifying : libblkid-2.23.2-26.el7.x86_64 53/66
276 Verifying : openssh-clients-6.6.1p1-23.el7_2.x86_64 54/66
277 Verifying : 1:java-1.7.0-openjdk-devel-1.7.0.95-2.6.4.0.el7_2.x86_64 55/66
278 Verifying : php-symfony-yaml-2.7.9-2.el7.noarch 56/66
279 Verifying : openssh-6.6.1p1-23.el7_2.x86_64 57/66
280 Verifying : git-1.8.3.1-6.el7.x86_64 58/66
281 Verifying : 1:java-1.7.0-openjdk-headless-1.7.0.95-2.6.4.0.el7_2.x86 59/66
282 Verifying : libmount-2.23.2-26.el7.x86_64 60/66
283 Verifying : 1:java-1.7.0-openjdk-1.7.0.95-2.6.4.0.el7_2.x86_64 61/66
284 Verifying : openldap-2.4.40-8.el7.x86_64 62/66
285 Verifying : 32:bind-utils-9.9.4-29.el7_2.2.x86_64 63/66
286 Verifying : tzdata-java-2016a-1.el7.noarch 64/66
287 Verifying : util-linux-2.23.2-26.el7.x86_64 65/66
288 Verifying : nss-util-3.19.1-4.el7_1.x86_64 66/66
289
290Updated:
291 bind-libs.x86_64 32:9.9.4-29.el7_2.3
292 bind-license.noarch 32:9.9.4-29.el7_2.3
293 bind-utils.x86_64 32:9.9.4-29.el7_2.3
294 epel-rpm-macros.noarch 0:7-7
295 git.x86_64 0:1.8.3.1-6.el7_2.1
296 java-1.7.0-openjdk.x86_64 1:1.7.0.99-2.6.5.0.el7_2
297 java-1.7.0-openjdk-devel.x86_64 1:1.7.0.99-2.6.5.0.el7_2
298 java-1.7.0-openjdk-headless.x86_64 1:1.7.0.99-2.6.5.0.el7_2
299 kernel-headers.x86_64 0:3.10.0-327.13.1.el7
300 kpartx.x86_64 0:0.4.9-85.el7_2.1
301 krb5-libs.x86_64 0:1.13.2-12.el7_2
302 libblkid.x86_64 0:2.23.2-26.el7_2.2
303 libmount.x86_64 0:2.23.2-26.el7_2.2
304 libssh2.x86_64 0:1.4.3-10.el7_2.1
305 libuuid.x86_64 0:2.23.2-26.el7_2.2
306 nss-util.x86_64 0:3.19.1-9.el7_2
307 openldap.x86_64 0:2.4.40-9.el7_2
308 openldap-clients.x86_64 0:2.4.40-9.el7_2
309 openssh.x86_64 0:6.6.1p1-25.el7_2
310 openssh-clients.x86_64 0:6.6.1p1-25.el7_2
311 osc.x86_64 0:0.153.0-177.1
312 perl-Git.noarch 0:1.8.3.1-6.el7_2.1
313 php-phpunit-PHPUnit.noarch 0:4.8.24-1.el7
314 php-symfony-class-loader.noarch 0:2.7.10-1.el7
315 php-symfony-common.noarch 0:2.7.10-1.el7
316 php-symfony-yaml.noarch 0:2.7.10-1.el7
317 php-tidy.x86_64 0:5.4.16-4.el7
318 sudo.x86_64 0:1.8.6p7-17.el7_2
319 systemd.x86_64 0:219-19.el7_2.7
320 systemd-libs.x86_64 0:219-19.el7_2.7
321 tzdata.noarch 0:2016c-1.el7
322 tzdata-java.noarch 0:2016c-1.el7
323 util-linux.x86_64 0:2.23.2-26.el7_2.2
324
325Complete!
326/srv/pykolab.git /srv/closure-compiler.git
327Running ../stick.git/drydocker/pykolab/test_build.sh ...
328++ version_for_commit
329++ pushd /srv/pykolab.git
330/srv/pykolab.git /srv/pykolab.git
331+++ git rev-parse --short HEAD
332++ short_rev=be3b581
333+++ git rev-parse HEAD
334++ long_rev=be3b581250f459b661c6e18072b7e9298475c504
335++ set -x
336+++ git branch --contains be3b581250f459b661c6e18072b7e9298475c504
337+++ sed -r -e 's/^\* //g' -e 's/^ //g'
338+++ grep -E '^(master|pykolab|[a-z0-9-]+([0-9]+\.?))'
339+++ sort --version-sort -u
340++ branches=pykolab-0.7
341++ echo 'Branches that contain be3b581250f459b661c6e18072b7e9298475c504:'
342Branches that contain be3b581250f459b661c6e18072b7e9298475c504:
343++ echo pykolab-0.7
344++ sed -e 's/\s/\r\n/g'
345pykolab-0.7
346+++ sed -e 's/\s/\r\n/g'
347+++ echo pykolab-0.7
348+++ grep -E '^master$'
349++ '[' '!' -z '' ']'
350+++ echo pykolab-0.7
351+++ sed -e 's/\s/\r\n/g'
352+++ tail -n 1
353++ branch=pykolab-0.7
354++ echo 'Branch is '\''pykolab-0.7'\'''
355Branch is 'pykolab-0.7'
356+++ git branch -la
357+++ sed -r -e 's/^\* //g' -e 's/^ remotes\/origin\///g' -e '/^HEAD/d'
358+++ sort --version-sort -u
359+++ grep -E '^(pykolab|[a-z0-9-]+([0-9]+\.?))'
360+++ tail -n 1
361++ latest_stable_branch=pykolab-0.7
362++ echo 'The latest stable branch is '\''pykolab-0.7'\'''
363The latest stable branch is 'pykolab-0.7'
364++ '[' pykolab-0.7 == master ']'
365++ master_version=0
366+++ echo pykolab-0.7
367+++ sed -r -e 's/^.*([0-9]+(\.[0-9]+)+)$/\1/g'
368++ stable_version=0.7
369++ echo 'This puts the version for stable at 0.7'
370This puts the version for stable at 0.7
371+++ git tag -l
372+++ grep -E '0.7(\.[0-9]+)+$'
373+++ sed -r -e 's/^.*([0-9]\.([0-9]+(\.[0-9]+)+))$/\1/g'
374+++ sort --version-sort -u
375+++ tail -n 1
376+++ awk -F. '{$NF+=1; OFS="."; print $0}'
377++ tag_version=0.7.23
378+++ echo -e '0\n0.7\n0.7.23'
379+++ sort --version-sort -u
380+++ tail -n 1
381++ new_version=0.7.23
382++ '[' 0.7.23 == 0 ']'
383++ echo 'Going with new version: '\''0.7.23'\'''
384Going with new version: '0.7.23'
385++ set - -x
386+ version=0.7.23
387++ project_for_package_version CentOS_7 0.7.23
388++ osc_project=CentOS_7
389++ target_version=0.7.23
390++ declare -a projects
391++ projects[${#projects[@]}]=Kolab:14
392++ projects[${#projects[@]}]=Kolab:14:Fasttrack
393++ projects[${#projects[@]}]=Kolab:3.4
394++ projects[${#projects[@]}]=Kolab:3.4:Updates
395++ projects[${#projects[@]}]=Kolab:16
396++ projects[${#projects[@]}]=Kolab:Winterfell
397++ current_version=
398++ current_project=
399++ x=0
400++ '[' 0 -lt 6 ']'
401+++ package_version_for_osc_project_repo Kolab:14 CentOS_7
402+++ osc_project=Kolab:14
403+++ osc_repository=CentOS_7
404++++ osc ls -b Kolab:14 pykolab CentOS_7 x86_64
405++++ grep '^pykolab'
406++++ head -n 1
407++++ grep -vE '*\.src\.rpm$'
408++++ sort
409+++ rpm_filename=
410+++ '[' -z '' ']'
411+++ echo 0
412+++ return
413++ version=0
414+++ rpmdev-vercmp 0 0.7.23
415+++ echo 12
416++ retval=12
417++ '[' 12 -eq 12 -o 12 -eq 0 ']'
418+++ rpmdev-vercmp '' 0
419+++ echo 12
420++ retval=12
421++ '[' 12 -eq 12 -o 12 -eq 0 ']'
422++ current_version=0
423++ current_project=Kolab:14
424++ let x++
425++ '[' 1 -lt 6 ']'
426+++ package_version_for_osc_project_repo Kolab:14:Fasttrack CentOS_7
427+++ osc_project=Kolab:14:Fasttrack
428+++ osc_repository=CentOS_7
429++++ osc ls -b Kolab:14:Fasttrack pykolab CentOS_7 x86_64
430++++ grep '^pykolab'
431++++ grep -vE '*\.src\.rpm$'
432++++ sort
433++++ head -n 1
434+++ rpm_filename=
435+++ '[' -z '' ']'
436+++ echo 0
437+++ return
438++ version=0
439+++ rpmdev-vercmp 0 0.7.23
440+++ echo 12
441++ retval=12
442++ '[' 12 -eq 12 -o 12 -eq 0 ']'
443+++ rpmdev-vercmp 0 0
444+++ echo 0
445++ retval=0
446++ '[' 0 -eq 12 -o 0 -eq 0 ']'
447++ current_version=0
448++ current_project=Kolab:14:Fasttrack
449++ let x++
450++ '[' 2 -lt 6 ']'
451+++ package_version_for_osc_project_repo Kolab:3.4 CentOS_7
452+++ osc_project=Kolab:3.4
453+++ osc_repository=CentOS_7
454++++ osc ls -b Kolab:3.4 pykolab CentOS_7 x86_64
455++++ grep '^pykolab'
456++++ sort
457++++ head -n 1
458++++ grep -vE '*\.src\.rpm$'
459+++ rpm_filename=pykolab-0.7.10-1.el7.kolab_3.4.noarch.rpm
460+++ '[' -z pykolab-0.7.10-1.el7.kolab_3.4.noarch.rpm ']'
461++++ osc getbinaries Kolab:3.4 pykolab CentOS_7 x86_64 pykolab-0.7.10-1.el7.kolab_3.4.noarch.rpm
462++++ echo 0
463+++ success=0
464+++ '[' 0 -ne 0 ']'
465++++ rpm -q '--queryformat=%{VERSION}\n' -p binaries/pykolab-0.7.10-1.el7.kolab_3.4.noarch.rpm
466+++ version=0.7.10
467+++ echo 0.7.10
468++ version=0.7.10
469+++ rpmdev-vercmp 0.7.10 0.7.23
470+++ echo 12
471++ retval=12
472++ '[' 12 -eq 12 -o 12 -eq 0 ']'
473+++ rpmdev-vercmp 0 0.7.10
474+++ echo 12
475++ retval=12
476++ '[' 12 -eq 12 -o 12 -eq 0 ']'
477++ current_version=0.7.10
478++ current_project=Kolab:3.4
479++ let x++
480++ '[' 3 -lt 6 ']'
481+++ package_version_for_osc_project_repo Kolab:3.4:Updates CentOS_7
482+++ osc_project=Kolab:3.4:Updates
483+++ osc_repository=CentOS_7
484++++ osc ls -b Kolab:3.4:Updates pykolab CentOS_7 x86_64
485++++ grep '^pykolab'
486++++ grep -vE '*\.src\.rpm$'
487++++ head -n 1
488++++ sort
489+++ rpm_filename=pykolab-0.7.10-4.el7.kolab_3.4.noarch.rpm
490+++ '[' -z pykolab-0.7.10-4.el7.kolab_3.4.noarch.rpm ']'
491++++ osc getbinaries Kolab:3.4:Updates pykolab CentOS_7 x86_64 pykolab-0.7.10-4.el7.kolab_3.4.noarch.rpm
492++++ echo 0
493+++ success=0
494+++ '[' 0 -ne 0 ']'
495++++ rpm -q '--queryformat=%{VERSION}\n' -p binaries/pykolab-0.7.10-4.el7.kolab_3.4.noarch.rpm
496+++ version=0.7.10
497+++ echo 0.7.10
498++ version=0.7.10
499+++ rpmdev-vercmp 0.7.10 0.7.23
500+++ echo 12
501++ retval=12
502++ '[' 12 -eq 12 -o 12 -eq 0 ']'
503+++ rpmdev-vercmp 0.7.10 0.7.10
504+++ echo 0
505++ retval=0
506++ '[' 0 -eq 12 -o 0 -eq 0 ']'
507++ current_version=0.7.10
508++ current_project=Kolab:3.4:Updates
509++ let x++
510++ '[' 4 -lt 6 ']'
511+++ package_version_for_osc_project_repo Kolab:16 CentOS_7
512+++ osc_project=Kolab:16
513+++ osc_repository=CentOS_7
514++++ osc ls -b Kolab:16 pykolab CentOS_7 x86_64
515++++ grep '^pykolab'
516++++ head -n 1
517++++ sort
518++++ grep -vE '*\.src\.rpm$'
519+++ rpm_filename=pykolab-0.8.1-2.3.el7.kolab_16.noarch.rpm
520+++ '[' -z pykolab-0.8.1-2.3.el7.kolab_16.noarch.rpm ']'
521++++ osc getbinaries Kolab:16 pykolab CentOS_7 x86_64 pykolab-0.8.1-2.3.el7.kolab_16.noarch.rpm
522++++ echo 0
523+++ success=0
524+++ '[' 0 -ne 0 ']'
525++++ rpm -q '--queryformat=%{VERSION}\n' -p binaries/pykolab-0.8.1-2.3.el7.kolab_16.noarch.rpm
526+++ version=0.8.1
527+++ echo 0.8.1
528++ version=0.8.1
529+++ rpmdev-vercmp 0.8.1 0.7.23
530+++ echo 11
531++ retval=11
532++ '[' 11 -eq 12 -o 11 -eq 0 ']'
533++ let x++
534++ '[' 5 -lt 6 ']'
535+++ package_version_for_osc_project_repo Kolab:Winterfell CentOS_7
536+++ osc_project=Kolab:Winterfell
537+++ osc_repository=CentOS_7
538++++ osc ls -b Kolab:Winterfell pykolab CentOS_7 x86_64
539++++ grep '^pykolab'
540++++ grep -vE '*\.src\.rpm$'
541++++ head -n 1
542++++ sort
543+++ rpm_filename=pykolab-0.8.1-7.4.el7.kolab_wf.noarch.rpm
544+++ '[' -z pykolab-0.8.1-7.4.el7.kolab_wf.noarch.rpm ']'
545++++ osc getbinaries Kolab:Winterfell pykolab CentOS_7 x86_64 pykolab-0.8.1-7.4.el7.kolab_wf.noarch.rpm
546++++ echo 0
547+++ success=0
548+++ '[' 0 -ne 0 ']'
549++++ rpm -q '--queryformat=%{VERSION}\n' -p binaries/pykolab-0.8.1-7.4.el7.kolab_wf.noarch.rpm
550+++ version=0.8.1
551+++ echo 0.8.1
552++ version=0.8.1
553+++ rpmdev-vercmp 0.8.1 0.7.23
554+++ echo 11
555++ retval=11
556++ '[' 11 -eq 12 -o 11 -eq 0 ']'
557++ let x++
558++ '[' 6 -lt 6 ']'
559++ echo Kolab:3.4:Updates
560+ osc_project=Kolab:3.4:Updates
561+ case ${osc_project} in
562++ find /etc/yum.repos.d/ -type f -name 'Kolab:*.repo' '!' -name 'Kolab:3.4*.repo'
563+ sed -i -r -e 's/enabled=.*/enabled=0/g' /etc/yum.repos.d/Kolab:Winterfell.repo /etc/yum.repos.d/Kolab:16.repo
564+ set - -x
565Loaded plugins: ovl, priorities
566Enabling base-source repository
567Enabling epel-source repository
568Enabling extras-source repository
569Enabling updates-source repository
57044 packages excluded due to repository priority protections
571Getting requirements for pykolab-0.7.10-1.el7.kolab_3.4.src
572 --> python-nose-1.3.0-3.el7.noarch
573 --> python-icalendar-3.8.2-7.1.el7.kolab_3.4.noarch
574 --> python-pyasn1-modules-0.1.6-2.el7.noarch
575 --> intltool-0.50.2-6.el7.noarch
576 --> glib2-devel-2.42.2-5.el7.x86_64
577 --> python-sqlalchemy-0.9.8-1.el7.x86_64
578 --> Already installed : python-2.7.5-34.el7.x86_64
579 --> python-pyasn1-0.1.6-2.el7.noarch
580 --> gettext-0.18.2.1-4.el7.x86_64
581 --> pytz-2012d-5.el7.noarch
582 --> python-kolabformat-1.1.git.1422810799-29.1.el7.kolab_3.4.x86_64
583 --> python-ldap-2.4.15-2.el7.x86_64
584 --> Already installed : gcc-4.8.5-4.el7.x86_64
585Getting requirements for pykolab-0.7.10-4.el7.kolab_3.4.src
586 --> python-nose-1.3.0-3.el7.noarch
587 --> python-icalendar-3.8.2-7.1.el7.kolab_3.4.noarch
588 --> python-pyasn1-modules-0.1.6-2.el7.noarch
589 --> intltool-0.50.2-6.el7.noarch
590 --> glib2-devel-2.42.2-5.el7.x86_64
591 --> Already installed : python-2.7.5-34.el7.x86_64
592 --> python-sqlalchemy-0.9.8-1.el7.x86_64
593 --> python-pyasn1-0.1.6-2.el7.noarch
594 --> gettext-0.18.2.1-4.el7.x86_64
595 --> pytz-2012d-5.el7.noarch
596 --> python-kolabformat-1.1.git.1422810799-29.1.el7.kolab_3.4.x86_64
597 --> python-ldap-2.4.15-2.el7.x86_64
598 --> Already installed : gcc-4.8.5-4.el7.x86_64
599Getting requirements for pykolab-0.7.10-1.el7.kolab_3.4.src
600 --> python-nose-1.3.0-3.el7.noarch
601 --> python-icalendar-3.8.2-7.1.el7.kolab_3.4.noarch
602 --> python-pyasn1-modules-0.1.6-2.el7.noarch
603 --> intltool-0.50.2-6.el7.noarch
604 --> glib2-devel-2.42.2-5.el7.x86_64
605 --> python-sqlalchemy-0.9.8-1.el7.x86_64
606 --> Already installed : python-2.7.5-34.el7.x86_64
607 --> python-pyasn1-0.1.6-2.el7.noarch
608 --> gettext-0.18.2.1-4.el7.x86_64
609 --> pytz-2012d-5.el7.noarch
610 --> python-kolabformat-1.1.git.1422810799-29.1.el7.kolab_3.4.x86_64
611 --> python-ldap-2.4.15-2.el7.x86_64
612 --> Already installed : gcc-4.8.5-4.el7.x86_64
613Getting requirements for pykolab-0.7.10-4.el7.kolab_3.4.src
614 --> python-nose-1.3.0-3.el7.noarch
615 --> python-icalendar-3.8.2-7.1.el7.kolab_3.4.noarch
616 --> python-pyasn1-modules-0.1.6-2.el7.noarch
617 --> intltool-0.50.2-6.el7.noarch
618 --> glib2-devel-2.42.2-5.el7.x86_64
619 --> Already installed : python-2.7.5-34.el7.x86_64
620 --> python-sqlalchemy-0.9.8-1.el7.x86_64
621 --> python-pyasn1-0.1.6-2.el7.noarch
622 --> gettext-0.18.2.1-4.el7.x86_64
623 --> pytz-2012d-5.el7.noarch
624 --> python-kolabformat-1.1.git.1422810799-29.1.el7.kolab_3.4.x86_64
625 --> python-ldap-2.4.15-2.el7.x86_64
626 --> Already installed : gcc-4.8.5-4.el7.x86_64
627--> Running transaction check
628---> Package gettext.x86_64 0:0.18.2.1-4.el7 will be installed
629--> Processing Dependency: libunistring.so.0()(64bit) for package: gettext-0.18.2.1-4.el7.x86_64
630--> Processing Dependency: libgettextsrc-0.18.2.so()(64bit) for package: gettext-0.18.2.1-4.el7.x86_64
631--> Processing Dependency: libgettextlib-0.18.2.so()(64bit) for package: gettext-0.18.2.1-4.el7.x86_64
632--> Processing Dependency: libcroco-0.6.so.3()(64bit) for package: gettext-0.18.2.1-4.el7.x86_64
633---> Package glib2-devel.x86_64 0:2.42.2-5.el7 will be installed
634---> Package intltool.noarch 0:0.50.2-6.el7 will be installed
635--> Processing Dependency: perl(XML::Parser) for package: intltool-0.50.2-6.el7.noarch
636--> Processing Dependency: gettext-devel for package: intltool-0.50.2-6.el7.noarch
637--> Processing Dependency: automake for package: intltool-0.50.2-6.el7.noarch
638---> Package python-icalendar.noarch 0:3.8.2-7.1.el7.kolab_3.4 will be installed
639--> Processing Dependency: python-dateutil for package: python-icalendar-3.8.2-7.1.el7.kolab_3.4.noarch
640---> Package python-kolabformat.x86_64 0:1.1.git.1422810799-29.1.el7.kolab_3.4 will be installed
641--> Processing Dependency: libkolabxml(x86-64) = 1.1.git.1422810799 for package: python-kolabformat-1.1.git.1422810799-29.1.el7.kolab_3.4.x86_64
642--> Processing Dependency: libboost_thread-mt.so.1.53.0()(64bit) for package: python-kolabformat-1.1.git.1422810799-29.1.el7.kolab_3.4.x86_64
643--> Processing Dependency: libboost_system-mt.so.1.53.0()(64bit) for package: python-kolabformat-1.1.git.1422810799-29.1.el7.kolab_3.4.x86_64
644--> Processing Dependency: libxerces-c-3.1.so()(64bit) for package: python-kolabformat-1.1.git.1422810799-29.1.el7.kolab_3.4.x86_64
645--> Processing Dependency: libkolabxml.so.1()(64bit) for package: python-kolabformat-1.1.git.1422810799-29.1.el7.kolab_3.4.x86_64
646---> Package python-ldap.x86_64 0:2.4.15-2.el7 will be installed
647---> Package python-nose.noarch 0:1.3.0-3.el7 will be installed
648--> Processing Dependency: python-setuptools for package: python-nose-1.3.0-3.el7.noarch
649---> Package python-pyasn1.noarch 0:0.1.6-2.el7 will be installed
650---> Package python-pyasn1-modules.noarch 0:0.1.6-2.el7 will be installed
651---> Package python-sqlalchemy.x86_64 0:0.9.8-1.el7 will be installed
652---> Package pytz.noarch 0:2012d-5.el7 will be installed
653--> Running transaction check
654---> Package automake.noarch 0:1.13.4-3.el7 will be installed
655--> Processing Dependency: autoconf >= 2.65 for package: automake-1.13.4-3.el7.noarch
656--> Processing Dependency: perl(TAP::Parser) for package: automake-1.13.4-3.el7.noarch
657---> Package boost-system.x86_64 0:1.53.0-25.el7 will be installed
658---> Package boost-thread.x86_64 0:1.53.0-25.el7 will be installed
659---> Package gettext-devel.x86_64 0:0.18.2.1-4.el7 will be installed
660--> Processing Dependency: gettext-common-devel = 0.18.2.1-4.el7 for package: gettext-devel-0.18.2.1-4.el7.x86_64
661---> Package gettext-libs.x86_64 0:0.18.2.1-4.el7 will be installed
662---> Package libcroco.x86_64 0:0.6.8-5.el7 will be installed
663---> Package libkolabxml.x86_64 0:1.1.git.1422810799-29.1.el7.kolab_3.4 will be installed
664---> Package libunistring.x86_64 0:0.9.3-9.el7 will be installed
665---> Package perl-XML-Parser.x86_64 0:2.41-10.el7 will be installed
666---> Package python-dateutil.noarch 0:1.5-7.el7 will be installed
667---> Package python-setuptools.noarch 0:0.9.8-4.el7 will be installed
668--> Processing Dependency: python-backports-ssl_match_hostname for package: python-setuptools-0.9.8-4.el7.noarch
669---> Package xerces-c.x86_64 0:3.1.1-8.el7_2 will be installed
670--> Running transaction check
671---> Package autoconf.noarch 0:2.69-11.el7 will be installed
672--> Processing Dependency: m4 >= 1.4.14 for package: autoconf-2.69-11.el7.noarch
673---> Package gettext-common-devel.noarch 0:0.18.2.1-4.el7 will be installed
674---> Package perl-Test-Harness.noarch 0:3.28-3.el7 will be installed
675---> Package python-backports-ssl_match_hostname.noarch 0:3.4.0.2-4.el7 will be installed
676--> Processing Dependency: python-backports for package: python-backports-ssl_match_hostname-3.4.0.2-4.el7.noarch
677--> Running transaction check
678---> Package m4.x86_64 0:1.4.16-10.el7 will be installed
679---> Package python-backports.x86_64 0:1.0-8.el7 will be installed
680--> Finished Dependency Resolution
681
682Dependencies Resolved
683
684================================================================================
685 Package Arch Version Repository
686 Size
687================================================================================
688Installing:
689 gettext x86_64 0.18.2.1-4.el7 base 959 k
690 glib2-devel x86_64 2.42.2-5.el7 base 448 k
691 intltool noarch 0.50.2-6.el7 base 59 k
692 python-icalendar noarch 3.8.2-7.1.el7.kolab_3.4 Kolab_3.4 93 k
693 python-kolabformat x86_64 1.1.git.1422810799-29.1.el7.kolab_3.4
694 Kolab_3.4 438 k
695 python-ldap x86_64 2.4.15-2.el7 base 159 k
696 python-nose noarch 1.3.0-3.el7 base 272 k
697 python-pyasn1 noarch 0.1.6-2.el7 base 91 k
698 python-pyasn1-modules noarch 0.1.6-2.el7 base 59 k
699 python-sqlalchemy x86_64 0.9.8-1.el7 base 2.9 M
700 pytz noarch 2012d-5.el7 base 38 k
701Installing for dependencies:
702 autoconf noarch 2.69-11.el7 base 701 k
703 automake noarch 1.13.4-3.el7 base 679 k
704 boost-system x86_64 1.53.0-25.el7 base 39 k
705 boost-thread x86_64 1.53.0-25.el7 base 57 k
706 gettext-common-devel noarch 0.18.2.1-4.el7 base 368 k
707 gettext-devel x86_64 0.18.2.1-4.el7 base 315 k
708 gettext-libs x86_64 0.18.2.1-4.el7 base 435 k
709 libcroco x86_64 0.6.8-5.el7 base 104 k
710 libkolabxml x86_64 1.1.git.1422810799-29.1.el7.kolab_3.4
711 Kolab_3.4 621 k
712 libunistring x86_64 0.9.3-9.el7 base 293 k
713 m4 x86_64 1.4.16-10.el7 base 256 k
714 perl-Test-Harness noarch 3.28-3.el7 base 302 k
715 perl-XML-Parser x86_64 2.41-10.el7 base 223 k
716 python-backports x86_64 1.0-8.el7 base 5.8 k
717 python-backports-ssl_match_hostname
718 noarch 3.4.0.2-4.el7 base 12 k
719 python-dateutil noarch 1.5-7.el7 base 85 k
720 python-setuptools noarch 0.9.8-4.el7 base 396 k
721 xerces-c x86_64 3.1.1-8.el7_2 updates 878 k
722
723Transaction Summary
724================================================================================
725Install 11 Packages (+18 Dependent packages)
726
727Total download size: 11 M
728Installed size: 52 M
729Downloading packages:
730--------------------------------------------------------------------------------
731Total 1.9 MB/s | 11 MB 00:05
732Running transaction check
733Running transaction test
734Transaction test succeeded
735Running transaction
736 Installing : boost-system-1.53.0-25.el7.x86_64 1/29
737 Installing : boost-thread-1.53.0-25.el7.x86_64 2/29
738 Installing : xerces-c-3.1.1-8.el7_2.x86_64 3/29
739 Installing : libunistring-0.9.3-9.el7.x86_64 4/29
740 Installing : libcroco-0.6.8-5.el7.x86_64 5/29
741 Installing : gettext-libs-0.18.2.1-4.el7.x86_64 6/29
742 Installing : gettext-0.18.2.1-4.el7.x86_64 7/29
743 Installing : libkolabxml-1.1.git.1422810799-29.1.el7.kolab_3.4.x86_64 8/29
744 Installing : pytz-2012d-5.el7.noarch 9/29
745 Installing : m4-1.4.16-10.el7.x86_64 10/29
746 Installing : autoconf-2.69-11.el7.noarch 11/29
747 Installing : python-pyasn1-0.1.6-2.el7.noarch 12/29
748 Installing : python-backports-1.0-8.el7.x86_64 13/29
749 Installing : python-backports-ssl_match_hostname-3.4.0.2-4.el7.noarch 14/29
750 Installing : python-setuptools-0.9.8-4.el7.noarch 15/29
751 Installing : gettext-common-devel-0.18.2.1-4.el7.noarch 16/29
752 Installing : gettext-devel-0.18.2.1-4.el7.x86_64 17/29
753 Installing : perl-Test-Harness-3.28-3.el7.noarch 18/29
754 Installing : automake-1.13.4-3.el7.noarch 19/29
755 Installing : python-dateutil-1.5-7.el7.noarch 20/29
756 Installing : perl-XML-Parser-2.41-10.el7.x86_64 21/29
757 Installing : intltool-0.50.2-6.el7.noarch 22/29
758 Installing : python-icalendar-3.8.2-7.1.el7.kolab_3.4.noarch 23/29
759 Installing : python-nose-1.3.0-3.el7.noarch 24/29
760 Installing : python-pyasn1-modules-0.1.6-2.el7.noarch 25/29
761 Installing : python-kolabformat-1.1.git.1422810799-29.1.el7.kolab_3.4 26/29
762 Installing : python-ldap-2.4.15-2.el7.x86_64 27/29
763 Installing : glib2-devel-2.42.2-5.el7.x86_64 28/29
764 Installing : python-sqlalchemy-0.9.8-1.el7.x86_64 29/29
765 Verifying : libcroco-0.6.8-5.el7.x86_64 1/29
766 Verifying : python-kolabformat-1.1.git.1422810799-29.1.el7.kolab_3.4 2/29
767 Verifying : python-backports-ssl_match_hostname-3.4.0.2-4.el7.noarch 3/29
768 Verifying : automake-1.13.4-3.el7.noarch 4/29
769 Verifying : libunistring-0.9.3-9.el7.x86_64 5/29
770 Verifying : python-sqlalchemy-0.9.8-1.el7.x86_64 6/29
771 Verifying : perl-XML-Parser-2.41-10.el7.x86_64 7/29
772 Verifying : python-icalendar-3.8.2-7.1.el7.kolab_3.4.noarch 8/29
773 Verifying : gettext-libs-0.18.2.1-4.el7.x86_64 9/29
774 Verifying : glib2-devel-2.42.2-5.el7.x86_64 10/29
775 Verifying : python-dateutil-1.5-7.el7.noarch 11/29
776 Verifying : perl-Test-Harness-3.28-3.el7.noarch 12/29
777 Verifying : xerces-c-3.1.1-8.el7_2.x86_64 13/29
778 Verifying : boost-thread-1.53.0-25.el7.x86_64 14/29
779 Verifying : libkolabxml-1.1.git.1422810799-29.1.el7.kolab_3.4.x86_64 15/29
780 Verifying : python-pyasn1-modules-0.1.6-2.el7.noarch 16/29
781 Verifying : gettext-common-devel-0.18.2.1-4.el7.noarch 17/29
782 Verifying : python-backports-1.0-8.el7.x86_64 18/29
783 Verifying : python-pyasn1-0.1.6-2.el7.noarch 19/29
784 Verifying : python-ldap-2.4.15-2.el7.x86_64 20/29
785 Verifying : python-setuptools-0.9.8-4.el7.noarch 21/29
786 Verifying : gettext-devel-0.18.2.1-4.el7.x86_64 22/29
787 Verifying : m4-1.4.16-10.el7.x86_64 23/29
788 Verifying : autoconf-2.69-11.el7.noarch 24/29
789 Verifying : intltool-0.50.2-6.el7.noarch 25/29
790 Verifying : python-nose-1.3.0-3.el7.noarch 26/29
791 Verifying : boost-system-1.53.0-25.el7.x86_64 27/29
792 Verifying : gettext-0.18.2.1-4.el7.x86_64 28/29
793 Verifying : pytz-2012d-5.el7.noarch 29/29
794
795Installed:
796 gettext.x86_64 0:0.18.2.1-4.el7
797 glib2-devel.x86_64 0:2.42.2-5.el7
798 intltool.noarch 0:0.50.2-6.el7
799 python-icalendar.noarch 0:3.8.2-7.1.el7.kolab_3.4
800 python-kolabformat.x86_64 0:1.1.git.1422810799-29.1.el7.kolab_3.4
801 python-ldap.x86_64 0:2.4.15-2.el7
802 python-nose.noarch 0:1.3.0-3.el7
803 python-pyasn1.noarch 0:0.1.6-2.el7
804 python-pyasn1-modules.noarch 0:0.1.6-2.el7
805 python-sqlalchemy.x86_64 0:0.9.8-1.el7
806 pytz.noarch 0:2012d-5.el7
807
808Dependency Installed:
809 autoconf.noarch 0:2.69-11.el7
810 automake.noarch 0:1.13.4-3.el7
811 boost-system.x86_64 0:1.53.0-25.el7
812 boost-thread.x86_64 0:1.53.0-25.el7
813 gettext-common-devel.noarch 0:0.18.2.1-4.el7
814 gettext-devel.x86_64 0:0.18.2.1-4.el7
815 gettext-libs.x86_64 0:0.18.2.1-4.el7
816 libcroco.x86_64 0:0.6.8-5.el7
817 libkolabxml.x86_64 0:1.1.git.1422810799-29.1.el7.kolab_3.4
818 libunistring.x86_64 0:0.9.3-9.el7
819 m4.x86_64 0:1.4.16-10.el7
820 perl-Test-Harness.noarch 0:3.28-3.el7
821 perl-XML-Parser.x86_64 0:2.41-10.el7
822 python-backports.x86_64 0:1.0-8.el7
823 python-backports-ssl_match_hostname.noarch 0:3.4.0.2-4.el7
824 python-dateutil.noarch 0:1.5-7.el7
825 python-setuptools.noarch 0:0.9.8-4.el7
826 xerces-c.x86_64 0:3.1.1-8.el7_2
827
828Complete!
829/srv/pykolab.git /srv/pykolab.git
830autoreconf: Entering directory `.'
831autoreconf: configure.ac: not using Gettext
832autoreconf: running: aclocal
833autoreconf: configure.ac: tracing
834autoreconf: configure.ac: not using Libtool
835autoreconf: running: /usr/bin/autoconf
836autoreconf: configure.ac: not using Autoheader
837autoreconf: running: automake --add-missing --copy --no-force
838Makefile.am:23: warning: wildcard tests/*.py: non-POSIX variable name
839Makefile.am:23: (probably a GNU make extension)
840Makefile.am:23: warning: wildcard tests/*/*.py: non-POSIX variable name
841Makefile.am:23: (probably a GNU make extension)
842Makefile.am:23: warning: wildcard tests/*/*/*.py: non-POSIX variable name
843Makefile.am:23: (probably a GNU make extension)
844kolabd/Makefile.am:8: warning: wildcard *.py: non-POSIX variable name
845kolabd/Makefile.am:8: (probably a GNU make extension)
846pykolab/Makefile.am:2: warning: wildcard *.py: non-POSIX variable name
847pykolab/Makefile.am:2: (probably a GNU make extension)
848pykolab/Makefile.am:16: warning: wildcard cli/*.py: non-POSIX variable name
849pykolab/Makefile.am:16: (probably a GNU make extension)
850pykolab/Makefile.am:20: warning: wildcard cli/sieve/*.py: non-POSIX variable name
851pykolab/Makefile.am:20: (probably a GNU make extension)
852pykolab/Makefile.am:24: warning: wildcard cli/telemetry/*.py: non-POSIX variable name
853pykolab/Makefile.am:24: (probably a GNU make extension)
854pykolab/Makefile.am:28: warning: wildcard cli/wap/*.py: non-POSIX variable name
855pykolab/Makefile.am:28: (probably a GNU make extension)
856pykolab/Makefile.am:85: warning: wildcard wap_client/*.py: non-POSIX variable name
857pykolab/Makefile.am:85: (probably a GNU make extension)
858pykolab/Makefile.am:89: warning: wildcard xml/*.py: non-POSIX variable name
859pykolab/Makefile.am:89: (probably a GNU make extension)
860saslauthd/Makefile.am:7: warning: wildcard *.py: non-POSIX variable name
861saslauthd/Makefile.am:7: (probably a GNU make extension)
862share/Makefile.am:2: warning: wildcard templates/*.tpl: non-POSIX variable name
863share/Makefile.am:2: (probably a GNU make extension)
864share/Makefile.am:2: warning: wildcard templates/header_checks.*: non-POSIX variable name
865share/Makefile.am:2: (probably a GNU make extension)
866share/Makefile.am:7: warning: wildcard templates/roundcubemail/*.tpl: non-POSIX variable name
867share/Makefile.am:7: (probably a GNU make extension)
868wallace/Makefile.am:8: warning: wildcard module_*.py: non-POSIX variable name
869wallace/Makefile.am:8: (probably a GNU make extension)
870autoreconf: Leaving directory `.'
871checking for a BSD-compatible install... /usr/bin/install -c
872checking whether build environment is sane... yes
873/srv/pykolab.git/missing: Unknown `--is-lightweight' option
874Try `/srv/pykolab.git/missing --help' for more information
875configure: WARNING: 'missing' script is too old or missing
876checking for a thread-safe mkdir -p... /usr/bin/mkdir -p
877checking for gawk... gawk
878checking whether make sets $(MAKE)... yes
879checking whether make supports nested variables... yes
880checking whether to enable maintainer-specific portions of Makefiles... no
881checking for python... /usr/bin/python
882checking for python version... 2.7
883checking for python platform... linux2
884checking for python script directory... ${prefix}/lib/python2.7/site-packages
885checking for python extension module directory... ${exec_prefix}/lib64/python2.7/site-packages
886checking for style of include used by make... GNU
887checking for gcc... gcc
888checking whether the C compiler works... yes
889checking for C compiler default output file name... a.out
890checking for suffix of executables...
891checking whether we are cross compiling... no
892checking for suffix of object files... o
893checking whether we are using the GNU C compiler... yes
894checking whether gcc accepts -g... yes
895checking for gcc option to accept ISO C89... none needed
896checking dependency style of gcc... none
897checking how to run the C preprocessor... gcc -E
898checking for grep that handles long lines and -e... /usr/bin/grep
899checking for egrep... /usr/bin/grep -E
900checking for ANSI C header files... yes
901checking for sys/types.h... yes
902checking for sys/stat.h... yes
903checking for stdlib.h... yes
904checking for string.h... yes
905checking for memory.h... yes
906checking for strings.h... yes
907checking for inttypes.h... yes
908checking for stdint.h... yes
909checking for unistd.h... yes
910checking locale.h usability... yes
911checking locale.h presence... yes
912checking for locale.h... yes
913checking for LC_MESSAGES... yes
914checking libintl.h usability... yes
915checking libintl.h presence... yes
916checking for libintl.h... yes
917checking for ngettext in libc... yes
918checking for dgettext in libc... yes
919checking for bind_textdomain_codeset... yes
920checking for msgfmt... /usr/bin/msgfmt
921checking for dcgettext... yes
922checking if msgfmt accepts -c... yes
923checking for gmsgfmt... /usr/bin/msgfmt
924checking for xgettext... /usr/bin/xgettext
925checking for catalogs to be installed... ach af af_ZA ak de de_DE es fr nl
926checking whether NLS is requested... yes
927checking for intltool-update... /usr/bin/intltool-update
928checking for intltool-merge... /usr/bin/intltool-merge
929checking for intltool-extract... /usr/bin/intltool-extract
930checking for xgettext... (cached) /usr/bin/xgettext
931checking for msgmerge... /usr/bin/msgmerge
932checking for msgfmt... (cached) /usr/bin/msgfmt
933checking for gmsgfmt... (cached) /usr/bin/msgfmt
934checking for perl... /usr/bin/perl
935checking for perl >= 5.8.1... 5.16.3
936checking for XML::Parser... ok
937checking whether ln -s works... yes
938checking that generated files are newer than configure... done
939configure: creating ./config.status
940config.status: creating bin/rebuild.sh
941config.status: creating Makefile
942config.status: creating pykolab.spec
943config.status: creating conf/Makefile
944config.status: creating kolabd/Makefile
945config.status: creating po/Makefile.in
946config.status: creating pykolab/constants.py
947config.status: creating pykolab/Makefile
948config.status: creating saslauthd/Makefile
949config.status: creating share/Makefile
950config.status: creating wallace/Makefile
951config.status: executing depfiles commands
952config.status: executing default-1 commands
953config.status: executing po/stamp-it commands
954/srv/pykolab.git
955Running ../stick.git/drydocker/pykolab/test_build.sh OK (at be3b581250f459b661c6e18072b7e9298475c504)
956Running ../stick.git/drydocker/pykolab/test_unit.sh ...
957/srv/pykolab.git /srv/pykolab.git
958test_pykolab (tests.unit.test-000-imports.TestImports) ... ok
959test_pykolab_xml (tests.unit.test-000-imports.TestImports) ... ok
960test_pykolab_xml_attendee (tests.unit.test-000-imports.TestImports) ... ok
961test_pykolab_xml_contact (tests.unit.test-000-imports.TestImports) ... ok
962test_pykolab_xml_contactReference (tests.unit.test-000-imports.TestImports) ... ok
963test_pykolab_xml_event (tests.unit.test-000-imports.TestImports) ... ok
964test_001_minimal (tests.unit.test-001-contact_reference.TestEventXML) ... ok
965test_002_empty_name (tests.unit.test-001-contact_reference.TestEventXML) ... ok
966test_003_set_name (tests.unit.test-001-contact_reference.TestEventXML) ... ok
967test_001_minimal (tests.unit.test-002-attendee.TestEventXML) ... ok
968test_002_empty_name (tests.unit.test-002-attendee.TestEventXML) ... ok
969test_003_set_name (tests.unit.test-002-attendee.TestEventXML) ... ok
970test_004_default_participant_status (tests.unit.test-002-attendee.TestEventXML) ... ok
971test_005_participant_status_map_length (tests.unit.test-002-attendee.TestEventXML) ... ok
972test_006_participant_status_map_forward_lookup (tests.unit.test-002-attendee.TestEventXML) ... ok
973test_007_participant_status_map_reverse_lookup (tests.unit.test-002-attendee.TestEventXML) ... ok
974test_008_default_rsvp (tests.unit.test-002-attendee.TestEventXML) ... ok
975test_009_rsvp_map_length (tests.unit.test-002-attendee.TestEventXML) ... ok
976test_010_rsvp_map_forward_lookup_boolean (tests.unit.test-002-attendee.TestEventXML) ... ok
977test_011_rsvp_map_forward_lookup_integer (tests.unit.test-002-attendee.TestEventXML) ... ok
978test_012_rsvp_map_reverse_lookup_boolean (tests.unit.test-002-attendee.TestEventXML) ... ok
979test_013_rsvp_map_reverse_lookup_integer (tests.unit.test-002-attendee.TestEventXML) ... ok
980test_014_default_role (tests.unit.test-002-attendee.TestEventXML) ... ok
981test_015_cutype_map_length (tests.unit.test-002-attendee.TestEventXML) ... ok
982test_015_role_map_length (tests.unit.test-002-attendee.TestEventXML) ... ok
983test_016_cutype_map_forward_lookup (tests.unit.test-002-attendee.TestEventXML) ... ok
984test_016_role_map_forward_lookup (tests.unit.test-002-attendee.TestEventXML) ... ok
985test_017_cutype_map_reverse_lookup (tests.unit.test-002-attendee.TestEventXML) ... ok
986test_017_role_map_reverse_lookup (tests.unit.test-002-attendee.TestEventXML) ... ok
987test_018_partstat_label (tests.unit.test-002-attendee.TestEventXML) ... ok
988test_020_to_dict (tests.unit.test-002-attendee.TestEventXML) ... ok
989test_000_no_start_date (tests.unit.test-003-event.TestEventXML) ... Error: /home/abuild/rpmbuild/BUILD/libkolabxml-1.1.git.1422810799/src/objectvalidation.cpp 91: event.start() is not set
990Error: /home/abuild/rpmbuild/BUILD/libkolabxml-1.1.git.1422810799/src/xcalconversions.h 1503: Start date is missing, but is mandatory for events
991Debug: /home/abuild/rpmbuild/BUILD/libkolabxml-1.1.git.1422810799/src/kolabformat.cpp 94: Error occurred while writing.
992ok
993test_001_minimal (tests.unit.test-003-event.TestEventXML) ... ok
994test_002_attendees_list (tests.unit.test-003-event.TestEventXML) ... ok
995test_003_attendees_no_default (tests.unit.test-003-event.TestEventXML) ... ok
996test_004_attendee_add (tests.unit.test-003-event.TestEventXML) ... ok
997test_005_attendee_add_name_and_props (tests.unit.test-003-event.TestEventXML) ... ok
998test_006_get_attendees (tests.unit.test-003-event.TestEventXML) ... ok
999test_007_get_attendee_by_email (tests.unit.test-003-event.TestEventXML) ... ok
1000test_007_get_attendee_props (tests.unit.test-003-event.TestEventXML) ... ok
1001test_007_get_nonexistent_attendee_by_email (tests.unit.test-003-event.TestEventXML) ... ok
1002test_008_get_attendee_by_name (tests.unit.test-003-event.TestEventXML) ... ok
1003test_008_get_nonexistent_attendee_by_name (tests.unit.test-003-event.TestEventXML) ... ok
1004test_009_invalid_participant_status (tests.unit.test-003-event.TestEventXML) ... ok
1005test_009_update_attendees (tests.unit.test-003-event.TestEventXML) ... ok
1006test_010_datetime_from_string (tests.unit.test-003-event.TestEventXML) ... ok
1007test_011_attendee_equality (tests.unit.test-003-event.TestEventXML) ... ok
1008test_012_delegate_new_attendee (tests.unit.test-003-event.TestEventXML) ... ok
1009test_013_delegatee_is_now_attendee (tests.unit.test-003-event.TestEventXML) ... ok
1010test_014_delegate_attendee_adds (tests.unit.test-003-event.TestEventXML) ... ok
1011test_015_timezone (tests.unit.test-003-event.TestEventXML) ... ok
1012test_016_start_with_timezone (tests.unit.test-003-event.TestEventXML) ... ok
1013test_017_allday_without_timezone (tests.unit.test-003-event.TestEventXML) ... ok
1014test_018_ical_allday_events (tests.unit.test-003-event.TestEventXML) ... ok
1015test_018_ical_to_message (tests.unit.test-003-event.TestEventXML) ... ERROR
1016test_018_load_from_ical (tests.unit.test-003-event.TestEventXML) ... ERROR
1017test_019_as_string_itip (tests.unit.test-003-event.TestEventXML) ... ok
1018test_019_to_message_itip (tests.unit.test-003-event.TestEventXML) ... ok
1019test_020_calendaring_recurrence (tests.unit.test-003-event.TestEventXML) ... ERROR
1020test_021_add_exceptions (tests.unit.test-003-event.TestEventXML) ... ERROR
1021test_021_allday_recurrence (tests.unit.test-003-event.TestEventXML) ... ERROR
1022test_021_calendaring_no_recurrence (tests.unit.test-003-event.TestEventXML) ... ERROR
1023test_021_ical_exceptions (tests.unit.test-003-event.TestEventXML) ... ok
1024test_021_single_instances (tests.unit.test-003-event.TestEventXML) ... ok
1025test_022_load_from_xml (tests.unit.test-003-event.TestEventXML) ... ERROR
1026test_023_load_from_message (tests.unit.test-003-event.TestEventXML) ... ERROR
1027test_024_bogus_itip_data (tests.unit.test-003-event.TestEventXML) ... Error: /home/abuild/rpmbuild/BUILD/libkolabxml-1.1.git.1422810799/src/utils.h 114: bad numeric conversion: negative overflow
1028Error: /home/abuild/rpmbuild/BUILD/libkolabxml-1.1.git.1422810799/src/utils.h 114: bad numeric conversion: negative overflow
1029schema exception
1030:26:25 error: value '' does not match regular expression facet '(\-|\+)?\d{4}\-\d{2}\-\d{2}T\d{2}:\d{2}:\d{2}(\.\d*)?Z?'
1031Critical: /home/abuild/rpmbuild/BUILD/libkolabxml-1.1.git.1422810799/src/xcalconversions.h 1944: Failed to parse calendar!
1032Debug: /home/abuild/rpmbuild/BUILD/libkolabxml-1.1.git.1422810799/src/kolabformat.cpp 94: Error occurred while writing.
1033ok
1034test_025_to_dict (tests.unit.test-003-event.TestEventXML) ... ok
1035test_026_compute_diff (tests.unit.test-003-event.TestEventXML) ... ok
1036test_026_property_to_string (tests.unit.test-003-event.TestEventXML) ... ok
1037test_027_merge_attendee_data (tests.unit.test-003-event.TestEventXML) ... ok
1038test_001_from_message_recurrence (tests.unit.test-004-icalendar.TestICalendar) ... ok
1039test_002_from_message (tests.unit.test-004-icalendar.TestICalendar) ... ok
1040test_001_timezone_conflict (tests.unit.test-005-timezone.TestTimezone) ... ok
1041test_001_import_psearch (tests.unit.test-006-ldap_psearch.TestLDAPPsearch) ... ok
1042test_001_import_syncrepl (tests.unit.test-007-ldap_syncrepl.TestLDAPSyncrepl) ... ok
1043test_001_import_sievelib (tests.unit.test-008-sievelib.TestSievelib) ... ERROR
1044test_002_parse_tests (tests.unit.test-008-sievelib.TestSievelib) ... ERROR
1045test_001_ldap_uri (tests.unit.test-009-parse_ldap_uri.TestParseLdapUri) ... ok
1046test_002_ldap_uri_port (tests.unit.test-009-parse_ldap_uri.TestParseLdapUri) ... ok
1047The special thing about this case is that the givenname starts with ... FAIL
1048The special thing about this case is that the givenname starts with ... FAIL
1049The special thing about this case is that the givenname starts with ... FAIL
1050The special thing about this case is that the givenname starts with ... FAIL
1051test_005_raw_ru_RU (tests.unit.test-010-transliterate.TestTransliteration) ... ok
1052test_006_unicode_ru_RU (tests.unit.test-010-transliterate.TestTransliteration) ... ok
1053test_007_raw_ru_RU (tests.unit.test-010-transliterate.TestTransliteration) ... ok
1054test_008_unicode_ru_RU (tests.unit.test-010-transliterate.TestTransliteration) ... ok
1055test_009_raw_decode (tests.unit.test-010-transliterate.TestTransliteration) ... ok
1056Failure: ImportError (No module named twisted.trial) ... ERROR
1057Failure: ImportError (No module named twisted.trial) ... ERROR
1058Failure: ImportError (No module named twisted.trial) ... ERROR
1059test_001_set (tests.unit.test-014-conf-and-raw.TestConfRaw) ... ok
1060test_002_get (tests.unit.test-014-conf-and-raw.TestConfRaw) ... ok
1061test_003_get_raw (tests.unit.test-014-conf-and-raw.TestConfRaw) ... ok
1062test_001_default_langs (tests.unit.test-015-translate.TestTranslate) ... ok
1063test_002_translate (tests.unit.test-015-translate.TestTranslate) ... ok
1064test_003_set_lang (tests.unit.test-015-translate.TestTranslate) ... ok
1065test_001_minimal (tests.unit.test-016-todo.TestTodoXML) ... ok
1066test_002_full (tests.unit.test-016-todo.TestTodoXML) ... ok
1067test_010_load_from_xml (tests.unit.test-016-todo.TestTodoXML) ... ok
1068test_020_load_from_ical (tests.unit.test-016-todo.TestTodoXML) ... ok
1069test_021_as_string_itip (tests.unit.test-016-todo.TestTodoXML) ... ok
1070test_022_ical_with_attachment (tests.unit.test-016-todo.TestTodoXML) ... ok
1071test_030_to_dict (tests.unit.test-016-todo.TestTodoXML) ... ok
1072test_000_order_proplists (tests.unit.test-017-diff.TestComputeDiff) ... ok
1073test_000_order_proplists2 (tests.unit.test-017-diff.TestComputeDiff) ... ok
1074test_001_attachments (tests.unit.test-017-diff.TestComputeDiff) ... ok
1075test_001_minimal (tests.unit.test-018-note.TestNoteXML) ... ok
1076test_002_full (tests.unit.test-018-note.TestNoteXML) ... ok
1077test_010_load_from_xml (tests.unit.test-018-note.TestNoteXML) ... ok
1078test_011_to_xml (tests.unit.test-018-note.TestNoteXML) ... ok
1079test_012_to_xml (tests.unit.test-018-note.TestNoteXML) ... ok
1080test_020_to_dict (tests.unit.test-018-note.TestNoteXML) ... ok
1081test_001_minimal (tests.unit.test-019-contact.TestContactXML) ... ok
1082test_002_full (tests.unit.test-019-contact.TestContactXML) ... ok
1083test_010_load_from_xml (tests.unit.test-019-contact.TestContactXML) ... ok
1084test_011_load_from_message (tests.unit.test-019-contact.TestContactXML) ... ok
1085test_020_to_dict (tests.unit.test-019-contact.TestContactXML) ... ok
1086test_001_plain_insert (tests.unit.test-020-auth_cache.TestAuthCache) ... ok
1087test_002_plain_encoding_insert (tests.unit.test-020-auth_cache.TestAuthCache) ... ok
1088test_003_unicode_insert (tests.unit.test-020-auth_cache.TestAuthCache) ... ok
1089test_004_unicode_escape (tests.unit.test-020-auth_cache.TestAuthCache) ... SKIP: Double encoding or decoding
1090test_005_longkey (tests.unit.test-020-auth_cache.TestAuthCache) ... ok
1091
1092======================================================================
1093ERROR: test_018_ical_to_message (tests.unit.test-003-event.TestEventXML)
1094----------------------------------------------------------------------
1095Traceback (most recent call last):
1096 File "/srv/pykolab.git/tests/unit/test-003-event.py", line 496, in test_018_ical_to_message
1097 event = event_from_ical(ical_event)
1098 File "./pykolab/xml/event.py", line 27, in event_from_ical
1099 return Event(from_ical=ical, from_string=string)
1100 File "./pykolab/xml/event.py", line 123, in __init__
1101 self.from_ical(from_ical, from_string)
1102 File "./pykolab/xml/event.py", line 341, in from_ical
1103 self._xml_from_ical(raw)
1104 File "./pykolab/xml/event.py", line 364, in _xml_from_ical
1105 from kolab.calendaring import EventCal
1106ImportError: No module named kolab.calendaring
1107
1108======================================================================
1109ERROR: test_018_load_from_ical (tests.unit.test-003-event.TestEventXML)
1110----------------------------------------------------------------------
1111Traceback (most recent call last):
1112 File "/srv/pykolab.git/tests/unit/test-003-event.py", line 468, in test_018_load_from_ical
1113 event = event_from_ical(ical.walk('VEVENT')[0], ical_str)
1114 File "./pykolab/xml/event.py", line 27, in event_from_ical
1115 return Event(from_ical=ical, from_string=string)
1116 File "./pykolab/xml/event.py", line 123, in __init__
1117 self.from_ical(from_ical, from_string)
1118 File "./pykolab/xml/event.py", line 341, in from_ical
1119 self._xml_from_ical(raw)
1120 File "./pykolab/xml/event.py", line 364, in _xml_from_ical
1121 from kolab.calendaring import EventCal
1122ImportError: No module named kolab.calendaring
1123
1124======================================================================
1125ERROR: test_020_calendaring_recurrence (tests.unit.test-003-event.TestEventXML)
1126----------------------------------------------------------------------
1127Traceback (most recent call last):
1128 File "/srv/pykolab.git/tests/unit/test-003-event.py", line 624, in test_020_calendaring_recurrence
1129 next_date = self.event.get_next_occurence(_start)
1130 File "./pykolab/xml/event.py", line 1324, in get_next_occurence
1131 self.eventcal = self.to_event_cal()
1132 File "./pykolab/xml/event.py", line 1319, in to_event_cal
1133 from kolab.calendaring import EventCal
1134ImportError: No module named kolab.calendaring
1135
1136======================================================================
1137ERROR: test_021_add_exceptions (tests.unit.test-003-event.TestEventXML)
1138----------------------------------------------------------------------
1139Traceback (most recent call last):
1140 File "/srv/pykolab.git/tests/unit/test-003-event.py", line 681, in test_021_add_exceptions
1141 event = event_from_ical(ical_event)
1142 File "./pykolab/xml/event.py", line 27, in event_from_ical
1143 return Event(from_ical=ical, from_string=string)
1144 File "./pykolab/xml/event.py", line 123, in __init__
1145 self.from_ical(from_ical, from_string)
1146 File "./pykolab/xml/event.py", line 341, in from_ical
1147 self._xml_from_ical(raw)
1148 File "./pykolab/xml/event.py", line 364, in _xml_from_ical
1149 from kolab.calendaring import EventCal
1150ImportError: No module named kolab.calendaring
1151
1152======================================================================
1153ERROR: test_021_allday_recurrence (tests.unit.test-003-event.TestEventXML)
1154----------------------------------------------------------------------
1155Traceback (most recent call last):
1156 File "/srv/pykolab.git/tests/unit/test-003-event.py", line 718, in test_021_allday_recurrence
1157 inst3 = self.event.get_instance(datetime.date(2015,1,3))
1158 File "./pykolab/xml/event.py", line 1407, in get_instance
1159 instance = self.get_next_instance(_datetime - datetime.timedelta(days=1))
1160 File "./pykolab/xml/event.py", line 1363, in get_next_instance
1161 next_start = self.get_next_occurence(datetime)
1162 File "./pykolab/xml/event.py", line 1324, in get_next_occurence
1163 self.eventcal = self.to_event_cal()
1164 File "./pykolab/xml/event.py", line 1319, in to_event_cal
1165 from kolab.calendaring import EventCal
1166ImportError: No module named kolab.calendaring
1167
1168======================================================================
1169ERROR: test_021_calendaring_no_recurrence (tests.unit.test-003-event.TestEventXML)
1170----------------------------------------------------------------------
1171Traceback (most recent call last):
1172 File "/srv/pykolab.git/tests/unit/test-003-event.py", line 677, in test_021_calendaring_no_recurrence
1173 self.assertEqual(self.event.get_next_occurence(_start), None)
1174 File "./pykolab/xml/event.py", line 1324, in get_next_occurence
1175 self.eventcal = self.to_event_cal()
1176 File "./pykolab/xml/event.py", line 1319, in to_event_cal
1177 from kolab.calendaring import EventCal
1178ImportError: No module named kolab.calendaring
1179
1180======================================================================
1181ERROR: test_022_load_from_xml (tests.unit.test-003-event.TestEventXML)
1182----------------------------------------------------------------------
1183Traceback (most recent call last):
1184 File "/srv/pykolab.git/tests/unit/test-003-event.py", line 812, in test_022_load_from_xml
1185 occurrence = event.get_next_instance(exception.get_start() - datetime.timedelta(days=1))
1186 File "./pykolab/xml/event.py", line 1363, in get_next_instance
1187 next_start = self.get_next_occurence(datetime)
1188 File "./pykolab/xml/event.py", line 1324, in get_next_occurence
1189 self.eventcal = self.to_event_cal()
1190 File "./pykolab/xml/event.py", line 1319, in to_event_cal
1191 from kolab.calendaring import EventCal
1192ImportError: No module named kolab.calendaring
1193
1194======================================================================
1195ERROR: test_023_load_from_message (tests.unit.test-003-event.TestEventXML)
1196----------------------------------------------------------------------
1197Traceback (most recent call last):
1198 File "/srv/pykolab.git/tests/unit/test-003-event.py", line 831, in test_023_load_from_message
1199 event = event_from_message(event_from_ical(ical_event).to_message())
1200 File "./pykolab/xml/event.py", line 27, in event_from_ical
1201 return Event(from_ical=ical, from_string=string)
1202 File "./pykolab/xml/event.py", line 123, in __init__
1203 self.from_ical(from_ical, from_string)
1204 File "./pykolab/xml/event.py", line 341, in from_ical
1205 self._xml_from_ical(raw)
1206 File "./pykolab/xml/event.py", line 364, in _xml_from_ical
1207 from kolab.calendaring import EventCal
1208ImportError: No module named kolab.calendaring
1209
1210======================================================================
1211ERROR: test_001_import_sievelib (tests.unit.test-008-sievelib.TestSievelib)
1212----------------------------------------------------------------------
1213Traceback (most recent call last):
1214 File "/srv/pykolab.git/tests/unit/test-008-sievelib.py", line 44, in test_001_import_sievelib
1215 from sievelib.parser import Parser
1216ImportError: No module named sievelib.parser
1217
1218======================================================================
1219ERROR: test_002_parse_tests (tests.unit.test-008-sievelib.TestSievelib)
1220----------------------------------------------------------------------
1221Traceback (most recent call last):
1222 File "/srv/pykolab.git/tests/unit/test-008-sievelib.py", line 47, in test_002_parse_tests
1223 from sievelib.parser import Parser
1224ImportError: No module named sievelib.parser
1225
1226======================================================================
1227ERROR: Failure: ImportError (No module named twisted.trial)
1228----------------------------------------------------------------------
1229Traceback (most recent call last):
1230 File "/usr/lib/python2.7/site-packages/nose/loader.py", line 413, in loadTestsFromName
1231 addr.filename, addr.module)
1232 File "/usr/lib/python2.7/site-packages/nose/importer.py", line 47, in importFromPath
1233 return self.importFromDir(dir_path, fqname)
1234 File "/usr/lib/python2.7/site-packages/nose/importer.py", line 94, in importFromDir
1235 mod = load_module(part_fqname, fh, filename, desc)
1236 File "/srv/pykolab.git/tests/unit/test-011-itip.py", line 17, in <module>
1237 from twisted.trial import unittest
1238ImportError: No module named twisted.trial
1239
1240======================================================================
1241ERROR: Failure: ImportError (No module named twisted.trial)
1242----------------------------------------------------------------------
1243Traceback (most recent call last):
1244 File "/usr/lib/python2.7/site-packages/nose/loader.py", line 413, in loadTestsFromName
1245 addr.filename, addr.module)
1246 File "/usr/lib/python2.7/site-packages/nose/importer.py", line 47, in importFromPath
1247 return self.importFromDir(dir_path, fqname)
1248 File "/usr/lib/python2.7/site-packages/nose/importer.py", line 94, in importFromDir
1249 mod = load_module(part_fqname, fh, filename, desc)
1250 File "/srv/pykolab.git/tests/unit/test-011-wallace_resources.py", line 10, in <module>
1251 from twisted.trial import unittest
1252ImportError: No module named twisted.trial
1253
1254======================================================================
1255ERROR: Failure: ImportError (No module named twisted.trial)
1256----------------------------------------------------------------------
1257Traceback (most recent call last):
1258 File "/usr/lib/python2.7/site-packages/nose/loader.py", line 413, in loadTestsFromName
1259 addr.filename, addr.module)
1260 File "/usr/lib/python2.7/site-packages/nose/importer.py", line 47, in importFromPath
1261 return self.importFromDir(dir_path, fqname)
1262 File "/usr/lib/python2.7/site-packages/nose/importer.py", line 94, in importFromDir
1263 mod = load_module(part_fqname, fh, filename, desc)
1264 File "/srv/pykolab.git/tests/unit/test-012-wallace_invitationpolicy.py", line 12, in <module>
1265 from twisted.trial import unittest
1266ImportError: No module named twisted.trial
1267
1268======================================================================
1269FAIL: The special thing about this case is that the givenname starts with
1270----------------------------------------------------------------------
1271Traceback (most recent call last):
1272 File "/srv/pykolab.git/tests/unit/test-010-transliterate.py", line 17, in test_001_raw_fr_FR
1273 self.assertEqual('Etienne-Nicolas', utils.translate(givenname, preferredlanguage))
1274AssertionError: 'Etienne-Nicolas' != u'\xc9tienne-Nicolas'
1275
1276======================================================================
1277FAIL: The special thing about this case is that the givenname starts with
1278----------------------------------------------------------------------
1279Traceback (most recent call last):
1280 File "/srv/pykolab.git/tests/unit/test-010-transliterate.py", line 31, in test_002_unicode_fr_FR
1281 self.assertEqual('Etienne-Nicolas', utils.translate(givenname, preferredlanguage))
1282AssertionError: 'Etienne-Nicolas' != u'\xc9tienne-Nicolas'
1283
1284======================================================================
1285FAIL: The special thing about this case is that the givenname starts with
1286----------------------------------------------------------------------
1287Traceback (most recent call last):
1288 File "/srv/pykolab.git/tests/unit/test-010-transliterate.py", line 45, in test_003_raw_es_ES
1289 self.assertEqual('Alvaro', utils.translate(givenname, preferredlanguage))
1290AssertionError: 'Alvaro' != u'\xc1lvaro'
1291
1292======================================================================
1293FAIL: The special thing about this case is that the givenname starts with
1294----------------------------------------------------------------------
1295Traceback (most recent call last):
1296 File "/srv/pykolab.git/tests/unit/test-010-transliterate.py", line 59, in test_004_unicode_es_ES
1297 self.assertEqual('Alvaro', utils.translate(givenname, preferredlanguage))
1298AssertionError: 'Alvaro' != u'\xc1lvaro'
1299
1300----------------------------------------------------------------------
1301Ran 124 tests in 0.662s
1302
1303FAILED (SKIP=1, errors=13, failures=4)
1304Running ../stick.git/drydocker/pykolab/test_unit.sh FAILED (at be3b581250f459b661c6e18072b7e9298475c504)
1305========================================================================
1306 Running '../stick.git/drydocker/pykolab/test_build.sh' OK (at be3b581250f459b661c6e18072b7e9298475c504)
1307 Running '../stick.git/drydocker/pykolab/test_unit.sh' FAILED (at be3b581250f459b661c6e18072b7e9298475c504)
1308========================================================================
1309/var/drydock/workingcopy-67/repo/pykolab
1310

Lease Working Copy

When
Completed at Apr 4 2016, 4:38 PM · Built instantly
Status
Passed

Wait for Previous Commits to Build

When
Completed at Apr 4 2016, 4:38 PM · Built instantly
Status
Passed

Event Timeline