Page MenuHomekolab.org

Build 3236

Drydock: Run Command

When
Completed at Apr 4 2016, 4:41 PM · Built for 2 m, 2 s
Status
Failed

Build Log 10124 (remote - stderr)
25 - 50 - 100 - Unlimited Lines

76do so (now or later) by using -b with the checkout command again. Example:
77
78 git checkout -b new_branch_name
79
80HEAD is now at a35735a... 0.5.14
81Previous HEAD position was a35735a... 0.5.14
82Switched to a new branch 'pykolab-0.6'
83Switched to a new branch 'pykolab-0.7'
84Note: checking out '068b917e729ab38d473559598abdc27832dfbd61'.
85
86You are in 'detached HEAD' state. You can look around, make experimental
87changes and commit them, and you can discard any commits you make in this
88state without impacting any branches by performing another checkout.
89
90If you want to create a new branch to retain commits you create, you may
91do so (now or later) by using -b with the checkout command again. Example:
92
93 git checkout -b new_branch_name
94
95HEAD is now at 068b917... Remove duplicated 'title' attribute mapping (#5119)
96+ exit 1
97+ retval=1
98+ popd
99+ exit 1
100

Build Log 10123 (remote - stdout)
25 - 50 - 100 - Unlimited Lines

1452----------------------------------------------------------------------
1453Traceback (most recent call last):
1454 File "/srv/pykolab.git/tests/unit/test-010-transliterate.py", line 45, in test_003_raw_es_ES
1455 self.assertEqual('Alvaro', utils.translate(givenname, preferredlanguage))
1456AssertionError: 'Alvaro' != u'\xc1lvaro'
1457
1458======================================================================
1459FAIL: The special thing about this case is that the givenname starts with
1460----------------------------------------------------------------------
1461Traceback (most recent call last):
1462 File "/srv/pykolab.git/tests/unit/test-010-transliterate.py", line 59, in test_004_unicode_es_ES
1463 self.assertEqual('Alvaro', utils.translate(givenname, preferredlanguage))
1464AssertionError: 'Alvaro' != u'\xc1lvaro'
1465
1466----------------------------------------------------------------------
1467Ran 140 tests in 2.994s
1468
1469FAILED (SKIP=1, errors=9, failures=4)
1470Running ../stick.git/drydocker/pykolab/test_unit.sh FAILED (at 068b917e729ab38d473559598abdc27832dfbd61)
1471========================================================================
1472 Running '../stick.git/drydocker/pykolab/test_build.sh' OK (at 068b917e729ab38d473559598abdc27832dfbd61)
1473 Running '../stick.git/drydocker/pykolab/test_unit.sh' FAILED (at 068b917e729ab38d473559598abdc27832dfbd61)
1474========================================================================
1475/var/drydock/workingcopy-215829/repo/pykolab
1476

Lease Working Copy

When
Completed at Apr 4 2016, 4:39 PM · Built instantly
Status
Passed

Wait for Previous Commits to Build

When
Completed at Apr 4 2016, 4:39 PM · Built instantly
Status
Passed

Event Timeline