Page MenuHomekolab.org

Build 3075

Drydock: Run Command

When
Completed at Mar 9 2016, 6:50 PM · Built for 1 m, 19 s
Status
Failed

Build Log 9860 (remote - stderr)
25 - 50 - 100 - Unlimited Lines

77do so (now or later) by using -b with the checkout command again. Example:
78
79 git checkout -b new_branch_name
80
81HEAD is now at a35735a... 0.5.14
82Previous HEAD position was a35735a... 0.5.14
83Switched to a new branch 'pykolab-0.6'
84Switched to a new branch 'pykolab-0.7'
85Note: checking out '30bf25f6e52a319d411276984ba0598c139730ba'.
86
87You are in 'detached HEAD' state. You can look around, make experimental
88changes and commit them, and you can discard any commits you make in this
89state without impacting any branches by performing another checkout.
90
91If you want to create a new branch to retain commits you create, you may
92do so (now or later) by using -b with the checkout command again. Example:
93
94 git checkout -b new_branch_name
95
96HEAD is now at 30bf25f... remove stray line that would reset the schema_files list, and try to install only the chwala mysql files. fixes https://issues.kolab.org/show_bug.cgi?id=5355 error: table roundcube.system does not exist
97+ exit 1
98+ retval=1
99+ popd
100+ exit 1
101

Build Log 9859 (remote - stdout)
25 - 50 - 100 - Unlimited Lines

1028----------------------------------------------------------------------
1029Traceback (most recent call last):
1030 File "/srv/pykolab.git/tests/unit/test-010-transliterate.py", line 45, in test_003_raw_es_ES
1031 self.assertEqual('Alvaro', utils.translate(givenname, preferredlanguage))
1032AssertionError: 'Alvaro' != u'\xc1lvaro'
1033
1034======================================================================
1035FAIL: The special thing about this case is that the givenname starts with
1036----------------------------------------------------------------------
1037Traceback (most recent call last):
1038 File "/srv/pykolab.git/tests/unit/test-010-transliterate.py", line 59, in test_004_unicode_es_ES
1039 self.assertEqual('Alvaro', utils.translate(givenname, preferredlanguage))
1040AssertionError: 'Alvaro' != u'\xc1lvaro'
1041
1042----------------------------------------------------------------------
1043Ran 140 tests in 3.274s
1044
1045FAILED (SKIP=1, failures=4)
1046Running ../stick.git/drydocker/pykolab/test_unit.sh FAILED (at 30bf25f6e52a319d411276984ba0598c139730ba)
1047========================================================================
1048 Running '../stick.git/drydocker/pykolab/test_build.sh' OK (at 30bf25f6e52a319d411276984ba0598c139730ba)
1049 Running '../stick.git/drydocker/pykolab/test_unit.sh' FAILED (at 30bf25f6e52a319d411276984ba0598c139730ba)
1050========================================================================
1051/var/drydock/workingcopy-215829/repo/pykolab
1052

Lease Working Copy

When
Completed at Mar 9 2016, 6:49 PM · Built instantly
Status
Passed

Wait for Previous Commits to Build

When
Completed at Mar 9 2016, 6:49 PM · Built instantly
Status
Passed

Event Timeline