Page MenuHomePhorge

Build 2919
FailedPublic

Drydock: Run Command

When
Completed at Feb 28 2016, 10:35 PM · Built for 3 m, 8 s
Status
Failed

Build Log 9520 (remote - stderr)
25 - 50 - 100 - Unlimited Lines

1+ '[' -z aaa5a98f486568a7779cca3a5ee7839802673dd3 -a -z '' ']'
2+ '[' -z ssh://git@git.kolab.org/diffusion/S/syncroton.git ']'
3+ '[' 0 -eq 0 -a 0 -eq 0 -a 0 -eq 0 -a 0 -eq 0 -a 0 -eq 0 -a 0 -eq 0 ']'
4+ test_build=1
5+ test_functional=1
6+ test_integration=1
7+ test_performance=1
8+ test_unit=1
9+ test_obs=1
10+ '[' -z git ']'
11+ case ${vcs} in
12++ basename ssh://git@git.kolab.org/diffusion/S/syncroton.git .git
13+ package=syncroton
14++ echo ssh://git@git.kolab.org/diffusion/S/syncroton.git
15++ sed -e 's|ssh://git@|https://|g'
16+ ro_uri=https://git.kolab.org/diffusion/S/syncroton.git
17+ case ${package} in
18+ package=kolab-syncroton
19++ pwd
20+ export TMPDIR=/var/drydock/workingcopy-54/repo/syncroton
21+ TMPDIR=/var/drydock/workingcopy-54/repo/syncroton
22+ '[' '!' -d kolab-syncroton.git ']'
23+ pushd kolab-syncroton.git
24+ git remote set-url origin https://git.kolab.org/diffusion/S/syncroton.git
25+ git fetch origin
26+ git reset --hard origin/master
27+ git clean -d -f -x
28+ git checkout aaa5a98f486568a7779cca3a5ee7839802673dd3
29Previous HEAD position was e4acac0... Update Syncroton
30HEAD is now at aaa5a98... Reverted kolabAllowSMTPRecipient changes for kolab_2_2_branch: cvs diff -u -d -r1.19 -r1.20 kolab-webadmin/kolab-webadmin/www/admin/user/user.php.in|patch -p0 -s -R cvs diff -u -d -r1.13 -r1.14 kolabd/kolabd/templates/slapd.conf.template.in|patch -p0 -s -R cvs diff -u -d -r1.22 -r1.24 kolabd/kolabd/kolab2.schema|patch -p0 -s -R
31+ popd
32+ '[' kolab-syncroton '!=' stick ']'
33+ '[' '!' -d stick.git ']'
34+ pushd stick.git
35+ git remote set-url origin https://git.kolab.org/diffusion/QA/stick.git
36+ git fetch origin
37+ git reset --hard origin/master
38+ git clean -d -f -x
39+ popd
40+ export commit
41+ export differential
42+ export id
43+ export package
44+ export phid
45+ export ro_uri
46+ export uri
47+ export vcs
48+ export test_build
49+ export test_functional
50+ export test_integration
51+ export test_performance
52+ export test_unit
53+ export test_obs
54+ '[' '!' -d /var/tmp/osbuild-packagecache ']'
55+ '[' -x stick.git/drydocker/kolab-syncroton/build.sh ']'
56+ pushd kolab-syncroton.git
57+ ../stick.git/drydocker/kolab-syncroton/build.sh
58+ docker run -i --attach=stdout --attach=stderr --detach=false --rm=true --volume=/root/.oscrc:/root/.oscrc --volume=/var/tmp/osbuild-packagecache/:/var/tmp/osbuild-packagecache/ --hostname=kolab.example.org -e ID=2919 -e COMMIT=aaa5a98f486568a7779cca3a5ee7839802673dd3 -e DIFFERENTIAL= -e PACKAGE=kolab-syncroton -e PHAB_CERT= -e PHAB_USER= -e PHID=PHID-HMBT-tfl5jxorwqhklg57hqis -e URI=ssh://git@git.kolab.org/diffusion/S/syncroton.git -e RO_URI=https://git.kolab.org/diffusion/S/syncroton.git -e VCS=git -e TEST_BUILD=1 -e TEST_FUNCTIONAL=1 -e TEST_INTEGRATION=1 -e TEST_PERFORMANCE=1 -e TEST_UNIT=1 -e TEST_OBS=1 kolab/ci-maipo
59Switched to a new branch 'kolab-syncroton-1.0'
60Switched to a new branch 'kolab-syncroton-2.1'
61Switched to a new branch 'kolab-syncroton-2.2'
62Switched to branch 'master'
63Switched to a new branch 'oracle'
64http://download.fedoraproject.org/pub/epel/7/x86_64/repodata/bd4552b809a5e9deea35297f323556daad4324fbb2a43f3945adfda6fcf75e24-primary.sqlite.xz: [Errno 14] HTTPS Error 404 - Not Found
65Trying other mirror.
66To address this issue please refer to the below knowledge base article
67
68https://access.redhat.com/articles/1320623
69
70If above article doesn't help to resolve this issue please create a bug on https://bugs.centos.org/
71
72http://download.fedoraproject.org/pub/epel/7/x86_64/repodata/bd4552b809a5e9deea35297f323556daad4324fbb2a43f3945adfda6fcf75e24-primary.sqlite.xz: [Errno 14] HTTP Error 404 - Not Found
73Trying other mirror.
74Note: checking out 'aaa5a98f486568a7779cca3a5ee7839802673dd3'.
75
76You are in 'detached HEAD' state. You can look around, make experimental
77changes and commit them, and you can discard any commits you make in this
78state without impacting any branches by performing another checkout.
79
80If you want to create a new branch to retain commits you create, you may
81do so (now or later) by using -b with the checkout command again. Example:
82
83 git checkout -b new_branch_name
84
85HEAD is now at aaa5a98... Reverted kolabAllowSMTPRecipient changes for kolab_2_2_branch: cvs diff -u -d -r1.19 -r1.20 kolab-webadmin/kolab-webadmin/www/admin/user/user.php.in|patch -p0 -s -R cvs diff -u -d -r1.13 -r1.14 kolabd/kolabd/templates/slapd.conf.template.in|patch -p0 -s -R cvs diff -u -d -r1.22 -r1.24 kolabd/kolabd/kolab2.schema|patch -p0 -s -R
86+ exit 1
87+ retval=1
88+ popd
89+ exit 1
90

Build Log 9519 (remote - stdout)
25 - 50 - 100 - Unlimited Lines

1/var/drydock/workingcopy-54/repo/syncroton/kolab-syncroton.git /var/drydock/workingcopy-54/repo/syncroton
2HEAD is now at e4acac0 Update Syncroton
3/var/drydock/workingcopy-54/repo/syncroton
4/var/drydock/workingcopy-54/repo/syncroton/stick.git /var/drydock/workingcopy-54/repo/syncroton
5HEAD is now at b575901 Rename that too
6/var/drydock/workingcopy-54/repo/syncroton
7/var/drydock/workingcopy-54/repo/syncroton/kolab-syncroton.git /var/drydock/workingcopy-54/repo/syncroton
8Cloning into '/srv/stick.git'...
9Cloning into '/srv/kolab-syncroton.git'...
10/srv/kolab-syncroton.git /srv/closure-compiler.git
11Branch kolab-syncroton-1.0 set up to track remote branch kolab-syncroton-1.0 from origin.
12Branch kolab-syncroton-2.1 set up to track remote branch kolab-syncroton-2.1 from origin.
13Branch kolab-syncroton-2.2 set up to track remote branch kolab-syncroton-2.2 from origin.
14Branch oracle set up to track remote branch oracle from origin.
15/srv/closure-compiler.git
16Loaded plugins: ovl, priorities
17Cleaning repos: Kolab_16 Kolab_3.4 Kolab_3.4_Updates Kolab_Winterfell base epel
18 : extras openSUSE_Tools updates
190 metadata files removed
200 sqlite files removed
210 metadata files removed
22Loaded plugins: ovl, priorities
23152 packages excluded due to repository priority protections
24No packages marked for update
25/srv/kolab-syncroton.git /srv/closure-compiler.git
26Running ../stick.git/drydocker/kolab-syncroton/test_build.sh ...
27++ version_for_commit
28++ pushd /srv/kolab-syncroton.git
29/srv/kolab-syncroton.git /srv/kolab-syncroton.git
30+++ git rev-parse --short HEAD
31++ short_rev=aaa5a98
32+++ git rev-parse HEAD
33++ long_rev=aaa5a98f486568a7779cca3a5ee7839802673dd3
34++ set -x
35+++ git branch --contains aaa5a98f486568a7779cca3a5ee7839802673dd3
36+++ sed -r -e 's/^\* //g' -e 's/^ //g'
37+++ grep -E '^(master|kolab-syncroton|[a-z0-9-]+([0-9]+\.?))'
38+++ sort --version-sort -u
39++ branches=master
40++ echo 'Branches that contain aaa5a98f486568a7779cca3a5ee7839802673dd3:'
41Branches that contain aaa5a98f486568a7779cca3a5ee7839802673dd3:
42++ echo master
43++ sed -e 's/\s/\r\n/g'
44master
45+++ echo master
46+++ sed -e 's/\s/\r\n/g'
47+++ grep -E '^master$'
48++ '[' '!' -z master ']'
49++ branch=master
50++ echo 'Branch is '\''master'\'''
51Branch is 'master'
52+++ git branch -la
53+++ sed -r -e 's/^\* //g' -e 's/^ remotes\/origin\///g' -e '/^HEAD/d'
54+++ grep -E '^(kolab-syncroton|[a-z0-9-]+([0-9]+\.?))'
55+++ sort --version-sort -u
56+++ tail -n 1
57++ latest_stable_branch=kolab-syncroton-2.2
58++ echo 'The latest stable branch is '\''kolab-syncroton-2.2'\'''
59The latest stable branch is 'kolab-syncroton-2.2'
60++ '[' master == master ']'
61++ '[' '!' -z kolab-syncroton-2.2 ']'
62+++ echo kolab-syncroton-2.2
63+++ sed -r -e 's/^.*([0-9]+(\.[0-9]+)+)$/\1/g'
64+++ awk -F. '{$NF+=1; OFS="."; print $0}'
65++ master_version=2.3
66++ echo 'This puts the version for master at '\''2.3'\'''
67This puts the version for master at '2.3'
68++ stable_version=0
69+++ git tag -l
70+++ grep -E '2.3(\.[0-9]+)+$'
71+++ sed -r -e 's/[^0-9\.]+//g'
72+++ sort --version-sort -u
73+++ tail -n 1
74+++ sed -r -e 's/^.*([0-9]\.([0-9]+(\.[0-9]+)+))$/\1/g'
75+++ awk -F. '{$NF+=1; OFS="."; print $0}'
76++ tag_version=2.3.3
77++ '[' -z 2.3.3 -a -z 2.3 ']'
78+++ echo -e '2.3\n0\n2.3.3'
79+++ sort --version-sort -u
80+++ tail -n 1
81++ new_version=2.3.3
82++ '[' 2.3.3 == 0 ']'
83++ echo 'Going with new version: '\''2.3.3'\'''
84Going with new version: '2.3.3'
85++ set - -x
86+ version=2.3.3
87++ project_for_package_version CentOS_7 2.3.3
88++ osc_project=CentOS_7
89++ target_version=2.3.3
90++ declare -a projects
91++ projects[${#projects[@]}]=Kolab:14
92++ projects[${#projects[@]}]=Kolab:14:Fasttrack
93++ projects[${#projects[@]}]=Kolab:3.4
94++ projects[${#projects[@]}]=Kolab:3.4:Updates
95++ projects[${#projects[@]}]=Kolab:16
96++ projects[${#projects[@]}]=Kolab:Winterfell
97++ current_version=
98++ current_project=
99++ x=0
100++ '[' 0 -lt 6 ']'
101+++ package_version_for_osc_project_repo Kolab:14 CentOS_7
102+++ osc_project=Kolab:14
103+++ osc_repository=CentOS_7
104++++ osc ls -b Kolab:14 kolab-syncroton CentOS_7 x86_64
105++++ grep '^kolab-syncroton'
106++++ grep -vE '*\.src\.rpm$'
107++++ sort
108++++ head -n 1
109+++ rpm_filename=
110+++ '[' -z '' ']'
111+++ echo 0
112+++ return
113++ version=0
114+++ rpmdev-vercmp 0 2.3.3
115+++ echo 12
116++ retval=12
117++ '[' 12 -eq 12 -o 12 -eq 0 ']'
118+++ rpmdev-vercmp '' 0
119+++ echo 12
120++ retval=12
121++ '[' 12 -eq 12 -o 12 -eq 0 ']'
122++ current_version=0
123++ current_project=Kolab:14
124++ let x++
125++ '[' 1 -lt 6 ']'
126+++ package_version_for_osc_project_repo Kolab:14:Fasttrack CentOS_7
127+++ osc_project=Kolab:14:Fasttrack
128+++ osc_repository=CentOS_7
129++++ osc ls -b Kolab:14:Fasttrack kolab-syncroton CentOS_7 x86_64
130++++ grep '^kolab-syncroton'
131++++ grep -vE '*\.src\.rpm$'
132++++ sort
133++++ head -n 1
134+++ rpm_filename=
135+++ '[' -z '' ']'
136+++ echo 0
137+++ return
138++ version=0
139+++ rpmdev-vercmp 0 2.3.3
140+++ echo 12
141++ retval=12
142++ '[' 12 -eq 12 -o 12 -eq 0 ']'
143+++ rpmdev-vercmp 0 0
144+++ echo 0
145++ retval=0
146++ '[' 0 -eq 12 -o 0 -eq 0 ']'
147++ current_version=0
148++ current_project=Kolab:14:Fasttrack
149++ let x++
150++ '[' 2 -lt 6 ']'
151+++ package_version_for_osc_project_repo Kolab:3.4 CentOS_7
152+++ osc_project=Kolab:3.4
153+++ osc_repository=CentOS_7
154++++ osc ls -b Kolab:3.4 kolab-syncroton CentOS_7 x86_64
155++++ grep '^kolab-syncroton'
156++++ grep -vE '*\.src\.rpm$'
157++++ sort
158++++ head -n 1
159+++ rpm_filename=kolab-syncroton-2.3.1-4.1.el7.kolab_3.4.noarch.rpm
160+++ '[' -z kolab-syncroton-2.3.1-4.1.el7.kolab_3.4.noarch.rpm ']'
161++++ osc getbinaries Kolab:3.4 kolab-syncroton CentOS_7 x86_64 kolab-syncroton-2.3.1-4.1.el7.kolab_3.4.noarch.rpm
162++++ echo 0
163+++ success=0
164+++ '[' 0 -ne 0 ']'
165++++ rpm -q '--queryformat=%{VERSION}\n' -p binaries/kolab-syncroton-2.3.1-4.1.el7.kolab_3.4.noarch.rpm
166+++ version=2.3.1
167+++ echo 2.3.1
168++ version=2.3.1
169+++ rpmdev-vercmp 2.3.1 2.3.3
170+++ echo 12
171++ retval=12
172++ '[' 12 -eq 12 -o 12 -eq 0 ']'
173+++ rpmdev-vercmp 0 2.3.1
174+++ echo 12
175++ retval=12
176++ '[' 12 -eq 12 -o 12 -eq 0 ']'
177++ current_version=2.3.1
178++ current_project=Kolab:3.4
179++ let x++
180++ '[' 3 -lt 6 ']'
181+++ package_version_for_osc_project_repo Kolab:3.4:Updates CentOS_7
182+++ osc_project=Kolab:3.4:Updates
183+++ osc_repository=CentOS_7
184++++ osc ls -b Kolab:3.4:Updates kolab-syncroton CentOS_7 x86_64
185++++ grep '^kolab-syncroton'
186++++ grep -vE '*\.src\.rpm$'
187++++ head -n 1
188++++ sort
189+++ rpm_filename=
190+++ '[' -z '' ']'
191+++ echo 0
192+++ return
193++ version=0
194+++ rpmdev-vercmp 0 2.3.3
195+++ echo 12
196++ retval=12
197++ '[' 12 -eq 12 -o 12 -eq 0 ']'
198+++ rpmdev-vercmp 2.3.1 0
199+++ echo 11
200++ retval=11
201++ '[' 11 -eq 12 -o 11 -eq 0 ']'
202++ let x++
203++ '[' 4 -lt 6 ']'
204+++ package_version_for_osc_project_repo Kolab:16 CentOS_7
205+++ osc_project=Kolab:16
206+++ osc_repository=CentOS_7
207++++ osc ls -b Kolab:16 kolab-syncroton CentOS_7 x86_64
208++++ grep '^kolab-syncroton'
209++++ grep -vE '*\.src\.rpm$'
210++++ sort
211++++ head -n 1
212+++ rpm_filename=kolab-syncroton-2.3.3-1.2.el7.kolab_16.noarch.rpm
213+++ '[' -z kolab-syncroton-2.3.3-1.2.el7.kolab_16.noarch.rpm ']'
214++++ osc getbinaries Kolab:16 kolab-syncroton CentOS_7 x86_64 kolab-syncroton-2.3.3-1.2.el7.kolab_16.noarch.rpm
215++++ echo 0
216+++ success=0
217+++ '[' 0 -ne 0 ']'
218++++ rpm -q '--queryformat=%{VERSION}\n' -p binaries/kolab-syncroton-2.3.3-1.2.el7.kolab_16.noarch.rpm
219+++ version=2.3.3
220+++ echo 2.3.3
221++ version=2.3.3
222+++ rpmdev-vercmp 2.3.3 2.3.3
223+++ echo 0
224++ retval=0
225++ '[' 0 -eq 12 -o 0 -eq 0 ']'
226+++ rpmdev-vercmp 2.3.1 2.3.3
227+++ echo 12
228++ retval=12
229++ '[' 12 -eq 12 -o 12 -eq 0 ']'
230++ current_version=2.3.3
231++ current_project=Kolab:16
232++ let x++
233++ '[' 5 -lt 6 ']'
234+++ package_version_for_osc_project_repo Kolab:Winterfell CentOS_7
235+++ osc_project=Kolab:Winterfell
236+++ osc_repository=CentOS_7
237++++ osc ls -b Kolab:Winterfell kolab-syncroton CentOS_7 x86_64
238++++ grep '^kolab-syncroton'
239++++ sort
240++++ head -n 1
241++++ grep -vE '*\.src\.rpm$'
242+++ rpm_filename=kolab-syncroton-2.3.3-1.8.el7.kolab_wf.noarch.rpm
243+++ '[' -z kolab-syncroton-2.3.3-1.8.el7.kolab_wf.noarch.rpm ']'
244++++ osc getbinaries Kolab:Winterfell kolab-syncroton CentOS_7 x86_64 kolab-syncroton-2.3.3-1.8.el7.kolab_wf.noarch.rpm
245++++ echo 0
246+++ success=0
247+++ '[' 0 -ne 0 ']'
248++++ rpm -q '--queryformat=%{VERSION}\n' -p binaries/kolab-syncroton-2.3.3-1.8.el7.kolab_wf.noarch.rpm
249+++ version=2.3.3
250+++ echo 2.3.3
251++ version=2.3.3
252+++ rpmdev-vercmp 2.3.3 2.3.3
253+++ echo 0
254++ retval=0
255++ '[' 0 -eq 12 -o 0 -eq 0 ']'
256+++ rpmdev-vercmp 2.3.3 2.3.3
257+++ echo 0
258++ retval=0
259++ '[' 0 -eq 12 -o 0 -eq 0 ']'
260++ current_version=2.3.3
261++ current_project=Kolab:Winterfell
262++ let x++
263++ '[' 6 -lt 6 ']'
264++ echo Kolab:Winterfell
265+ osc_project=Kolab:Winterfell
266+ case ${osc_project} in
267++ find /etc/yum.repos.d/ -type f -name 'Kolab:*.repo' '!' -name Kolab:Winterfell.repo
268+ sed -i -r -e 's/enabled=.*/enabled=0/g' /etc/yum.repos.d/Kolab:3.4.repo /etc/yum.repos.d/Kolab:16.repo /etc/yum.repos.d/Kolab:3.4:Updates.repo
269+ set - -x
270Loaded plugins: ovl, priorities
271Enabling base-source repository
272Enabling epel-source repository
273Enabling extras-source repository
274Enabling updates-source repository
275181 packages excluded due to repository priority protections
276Getting requirements for kolab-syncroton-2.3.3-1.8.el7.kolab_wf.src
277 --> roundcubemail-plugin-kolab_auth-3.3-21.1.el7.kolab_wf.noarch
278 --> roundcubemail-plugin-kolab_folders-3.3-21.1.el7.kolab_wf.noarch
279 --> roundcubemail-plugin-libkolab-3.3-21.1.el7.kolab_wf.noarch
280Getting requirements for kolab-syncroton-2.3.3-1.8.el7.kolab_wf.src
281 --> roundcubemail-plugin-kolab_auth-3.3-21.1.el7.kolab_wf.noarch
282 --> roundcubemail-plugin-kolab_folders-3.3-21.1.el7.kolab_wf.noarch
283 --> roundcubemail-plugin-libkolab-3.3-21.1.el7.kolab_wf.noarch
284--> Running transaction check
285---> Package roundcubemail-plugin-kolab_auth.noarch 0:3.3-21.1.el7.kolab_wf will be installed
286--> Processing Dependency: roundcubemail(plugin-kolab_auth-assets) = 3.3-21.1.el7.kolab_wf for package: roundcubemail-plugin-kolab_auth-3.3-21.1.el7.kolab_wf.noarch
287--> Processing Dependency: roundcubemail(core) >= 1.2 for package: roundcubemail-plugin-kolab_auth-3.3-21.1.el7.kolab_wf.noarch
288---> Package roundcubemail-plugin-kolab_folders.noarch 0:3.3-21.1.el7.kolab_wf will be installed
289--> Processing Dependency: roundcubemail(plugin-kolab_folders-assets) = 3.3-21.1.el7.kolab_wf for package: roundcubemail-plugin-kolab_folders-3.3-21.1.el7.kolab_wf.noarch
290---> Package roundcubemail-plugin-libkolab.noarch 0:3.3-21.1.el7.kolab_wf will be installed
291--> Processing Dependency: roundcubemail(plugin-libkolab-skin) = 3.3-21.1.el7.kolab_wf for package: roundcubemail-plugin-libkolab-3.3-21.1.el7.kolab_wf.noarch
292--> Processing Dependency: roundcubemail(plugin-libkolab-assets) = 3.3-21.1.el7.kolab_wf for package: roundcubemail-plugin-libkolab-3.3-21.1.el7.kolab_wf.noarch
293--> Running transaction check
294---> Package roundcubemail-core.noarch 0:1.2-7.2.el7.kolab_wf will be installed
295--> Processing Dependency: roundcubemail(plugin-jqueryui) = 1.2-7.2.el7.kolab_wf for package: roundcubemail-core-1.2-7.2.el7.kolab_wf.noarch
296--> Processing Dependency: roundcubemail(plugin-filesystem_attachments) = 1.2-7.2.el7.kolab_wf for package: roundcubemail-core-1.2-7.2.el7.kolab_wf.noarch
297--> Processing Dependency: roundcubemail(core-assets) = 1.2-7.2.el7.kolab_wf for package: roundcubemail-core-1.2-7.2.el7.kolab_wf.noarch
298--> Processing Dependency: roundcubemail(skin) = 1.2-7.2.el7.kolab_wf for package: roundcubemail-core-1.2-7.2.el7.kolab_wf.noarch
299--> Processing Dependency: php-pear(MDB2) >= 2.5.0 for package: roundcubemail-core-1.2-7.2.el7.kolab_wf.noarch
300--> Processing Dependency: php-pear >= 1.9.0 for package: roundcubemail-core-1.2-7.2.el7.kolab_wf.noarch
301--> Processing Dependency: php-pear(DB) for package: roundcubemail-core-1.2-7.2.el7.kolab_wf.noarch
302--> Processing Dependency: php-pear(Net_LDAP2) for package: roundcubemail-core-1.2-7.2.el7.kolab_wf.noarch
303--> Processing Dependency: php-pear(Auth_SASL) for package: roundcubemail-core-1.2-7.2.el7.kolab_wf.noarch
304--> Processing Dependency: php-pear(Net_LDAP3) for package: roundcubemail-core-1.2-7.2.el7.kolab_wf.noarch
305--> Processing Dependency: php-pear(Mail_mimeDecode) for package: roundcubemail-core-1.2-7.2.el7.kolab_wf.noarch
306--> Processing Dependency: php-pear(Net_Socket) for package: roundcubemail-core-1.2-7.2.el7.kolab_wf.noarch
307--> Processing Dependency: php-mcrypt for package: roundcubemail-core-1.2-7.2.el7.kolab_wf.noarch
308--> Processing Dependency: php-pear(Net_IDNA2) for package: roundcubemail-core-1.2-7.2.el7.kolab_wf.noarch
309--> Processing Dependency: webserver for package: roundcubemail-core-1.2-7.2.el7.kolab_wf.noarch
310--> Processing Dependency: php-pear(MDB2_Driver_mysqli) for package: roundcubemail-core-1.2-7.2.el7.kolab_wf.noarch
311--> Processing Dependency: php-pear(Mail_Mime) for package: roundcubemail-core-1.2-7.2.el7.kolab_wf.noarch
312--> Processing Dependency: php-pear(Net_Sieve) for package: roundcubemail-core-1.2-7.2.el7.kolab_wf.noarch
313--> Processing Dependency: php-gd for package: roundcubemail-core-1.2-7.2.el7.kolab_wf.noarch
314--> Processing Dependency: php-pear(Net_SMTP) for package: roundcubemail-core-1.2-7.2.el7.kolab_wf.noarch
315---> Package roundcubemail-plugin-kolab_auth-assets.noarch 0:3.3-21.1.el7.kolab_wf will be installed
316---> Package roundcubemail-plugin-kolab_folders-assets.noarch 0:3.3-21.1.el7.kolab_wf will be installed
317---> Package roundcubemail-plugin-libkolab-assets.noarch 0:3.3-21.1.el7.kolab_wf will be installed
318---> Package roundcubemail-plugin-libkolab-skin-larry-assets.noarch 0:3.3-21.1.el7.kolab_wf will be installed
319--> Running transaction check
320---> Package lighttpd.x86_64 0:1.4.39-1.el7 will be installed
321--> Processing Dependency: system-logos >= 7.92.1 for package: lighttpd-1.4.39-1.el7.x86_64
322--> Processing Dependency: libfam.so.0()(64bit) for package: lighttpd-1.4.39-1.el7.x86_64
323---> Package php-gd.x86_64 0:5.4.16-36.el7_1 will be installed
324--> Processing Dependency: libt1.so.5()(64bit) for package: php-gd-5.4.16-36.el7_1.x86_64
325--> Processing Dependency: libXpm.so.4()(64bit) for package: php-gd-5.4.16-36.el7_1.x86_64
326---> Package php-kolab-net-ldap3.noarch 0:1.0.4-3.3.el7.kolab_wf will be installed
327--> Processing Dependency: mozldap-tools >= 6.0.5 for package: php-kolab-net-ldap3-1.0.4-3.3.el7.kolab_wf.noarch
328--> Processing Dependency: php-ldap for package: php-kolab-net-ldap3-1.0.4-3.3.el7.kolab_wf.noarch
329---> Package php-mcrypt.x86_64 0:5.4.16-3.el7 will be installed
330--> Processing Dependency: libmcrypt.so.4()(64bit) for package: php-mcrypt-5.4.16-3.el7.x86_64
331---> Package php-pear.noarch 1:1.9.4-21.el7 will be installed
332--> Processing Dependency: php-posix for package: 1:php-pear-1.9.4-21.el7.noarch
333---> Package php-pear-Auth-SASL.noarch 0:1.0.6-5.el7 will be installed
334---> Package php-pear-DB.noarch 0:1.7.14-6.el7 will be installed
335---> Package php-pear-MDB2.noarch 0:2.5.0-0.9.b5.el7 will be installed
336---> Package php-pear-MDB2-Driver-mysqli.noarch 0:1.5.0-0.8.b4.el7 will be installed
337--> Processing Dependency: php-mysqli for package: php-pear-MDB2-Driver-mysqli-1.5.0-0.8.b4.el7.noarch
338---> Package php-pear-Mail-Mime.noarch 0:1.10.0-1.el7 will be installed
339---> Package php-pear-Mail-mimeDecode.noarch 0:1.5.5-7.el7 will be installed
340---> Package php-pear-Net-IDNA2.noarch 0:0.1.1-10.el7 will be installed
341---> Package php-pear-Net-LDAP2.noarch 0:2.0.12-1.3.el7.kolab_wf will be installed
342---> Package php-pear-Net-SMTP.noarch 0:1.7.1-1.el7 will be installed
343---> Package php-pear-Net-Sieve.noarch 0:1.3.4-4.el7 will be installed
344---> Package php-pear-Net-Socket.noarch 0:1.0.14-1.el7 will be installed
345---> Package roundcubemail-core-assets.noarch 0:1.2-7.2.el7.kolab_wf will be installed
346---> Package roundcubemail-plugin-filesystem_attachments.noarch 0:1.2-7.2.el7.kolab_wf will be installed
347--> Processing Dependency: roundcubemail(plugin-filesystem_attachments-assets) = 1.2-7.2.el7.kolab_wf for package: roundcubemail-plugin-filesystem_attachments-1.2-7.2.el7.kolab_wf.noarch
348---> Package roundcubemail-plugin-jqueryui.noarch 0:1.2-7.2.el7.kolab_wf will be installed
349--> Processing Dependency: roundcubemail(plugin-jqueryui-skin) = 1.2-7.2.el7.kolab_wf for package: roundcubemail-plugin-jqueryui-1.2-7.2.el7.kolab_wf.noarch
350--> Processing Dependency: roundcubemail(plugin-jqueryui-assets) = 1.2-7.2.el7.kolab_wf for package: roundcubemail-plugin-jqueryui-1.2-7.2.el7.kolab_wf.noarch
351---> Package roundcubemail-skin-larry.noarch 0:1.2-7.2.el7.kolab_wf will be installed
352--> Processing Dependency: roundcubemail(skin-larry-assets) = 1.2-7.2.el7.kolab_wf for package: roundcubemail-skin-larry-1.2-7.2.el7.kolab_wf.noarch
353--> Running transaction check
354---> Package centos-logos.noarch 0:70.0.6-3.el7.centos will be installed
355---> Package gamin.x86_64 0:0.1.10-16.el7 will be installed
356---> Package libXpm.x86_64 0:3.5.11-3.el7 will be installed
357---> Package libmcrypt.x86_64 0:2.5.8-13.el7 will be installed
358---> Package mozldap-tools.x86_64 0:6.0.5-11.3.el7.kolab_wf will be installed
359--> Processing Dependency: mozldap = 6.0.5-11.3.el7.kolab_wf for package: mozldap-tools-6.0.5-11.3.el7.kolab_wf.x86_64
360--> Processing Dependency: libldap60.so()(64bit) for package: mozldap-tools-6.0.5-11.3.el7.kolab_wf.x86_64
361--> Processing Dependency: libssldap60.so()(64bit) for package: mozldap-tools-6.0.5-11.3.el7.kolab_wf.x86_64
362--> Processing Dependency: libprldap60.so()(64bit) for package: mozldap-tools-6.0.5-11.3.el7.kolab_wf.x86_64
363--> Processing Dependency: libsvrcore.so.0()(64bit) for package: mozldap-tools-6.0.5-11.3.el7.kolab_wf.x86_64
364--> Processing Dependency: libldif60.so()(64bit) for package: mozldap-tools-6.0.5-11.3.el7.kolab_wf.x86_64
365---> Package php-ldap.x86_64 0:5.4.16-36.el7_1 will be installed
366---> Package php-mysqlnd.x86_64 0:5.4.16-36.el7_1 will be installed
367--> Processing Dependency: php-pdo(x86-64) = 5.4.16-36.el7_1 for package: php-mysqlnd-5.4.16-36.el7_1.x86_64
368---> Package php-process.x86_64 0:5.4.16-36.el7_1 will be installed
369---> Package roundcubemail-plugin-filesystem_attachments-assets.noarch 0:1.2-7.2.el7.kolab_wf will be installed
370---> Package roundcubemail-plugin-jqueryui-assets.noarch 0:1.2-7.2.el7.kolab_wf will be installed
371---> Package roundcubemail-plugin-jqueryui-skin-larry.noarch 0:1.2-7.2.el7.kolab_wf will be installed
372--> Processing Dependency: roundcubemail(plugin-jqueryui-skin-larry-assets) = 1.2-7.2.el7.kolab_wf for package: roundcubemail-plugin-jqueryui-skin-larry-1.2-7.2.el7.kolab_wf.noarch
373---> Package roundcubemail-skin-larry-assets.noarch 0:1.2-7.2.el7.kolab_wf will be installed
374---> Package t1lib.x86_64 0:5.1.2-14.el7 will be installed
375--> Running transaction check
376---> Package mozldap.x86_64 0:6.0.5-11.3.el7.kolab_wf will be installed
377---> Package php-pdo.x86_64 0:5.4.16-36.el7_1 will be installed
378---> Package roundcubemail-plugin-jqueryui-skin-larry-assets.noarch 0:1.2-7.2.el7.kolab_wf will be installed
379---> Package svrcore.x86_64 0:4.0.4-11.el7 will be installed
380--> Finished Dependency Resolution
381
382Dependencies Resolved
383
384================================================================================
385 Package Arch Version Repository Size
386================================================================================
387Installing:
388 roundcubemail-plugin-kolab_auth
389 noarch 3.3-21.1.el7.kolab_wf Kolab_Winterfell 35 k
390 roundcubemail-plugin-kolab_folders
391 noarch 3.3-21.1.el7.kolab_wf Kolab_Winterfell 34 k
392 roundcubemail-plugin-libkolab
393 noarch 3.3-21.1.el7.kolab_wf Kolab_Winterfell 119 k
394Installing for dependencies:
395 centos-logos noarch 70.0.6-3.el7.centos base 21 M
396 gamin x86_64 0.1.10-16.el7 base 128 k
397 libXpm x86_64 3.5.11-3.el7 base 54 k
398 libmcrypt x86_64 2.5.8-13.el7 epel 99 k
399 lighttpd x86_64 1.4.39-1.el7 epel 332 k
400 mozldap x86_64 6.0.5-11.3.el7.kolab_wf Kolab_Winterfell 133 k
401 mozldap-tools x86_64 6.0.5-11.3.el7.kolab_wf Kolab_Winterfell 77 k
402 php-gd x86_64 5.4.16-36.el7_1 base 126 k
403 php-kolab-net-ldap3 noarch 1.0.4-3.3.el7.kolab_wf Kolab_Winterfell 27 k
404 php-ldap x86_64 5.4.16-36.el7_1 base 51 k
405 php-mcrypt x86_64 5.4.16-3.el7 epel 20 k
406 php-mysqlnd x86_64 5.4.16-36.el7_1 base 172 k
407 php-pdo x86_64 5.4.16-36.el7_1 base 97 k
408 php-pear noarch 1:1.9.4-21.el7 base 357 k
409 php-pear-Auth-SASL noarch 1.0.6-5.el7 epel 16 k
410 php-pear-DB noarch 1.7.14-6.el7 epel 106 k
411 php-pear-MDB2 noarch 2.5.0-0.9.b5.el7 epel 125 k
412 php-pear-MDB2-Driver-mysqli
413 noarch 1.5.0-0.8.b4.el7 epel 43 k
414 php-pear-Mail-Mime noarch 1.10.0-1.el7 epel 46 k
415 php-pear-Mail-mimeDecode noarch 1.5.5-7.el7 epel 18 k
416 php-pear-Net-IDNA2 noarch 0.1.1-10.el7 epel 25 k
417 php-pear-Net-LDAP2 noarch 2.0.12-1.3.el7.kolab_wf Kolab_Winterfell 86 k
418 php-pear-Net-SMTP noarch 1.7.1-1.el7 epel 24 k
419 php-pear-Net-Sieve noarch 1.3.4-4.el7 epel 20 k
420 php-pear-Net-Socket noarch 1.0.14-1.el7 epel 13 k
421 php-process x86_64 5.4.16-36.el7_1 base 54 k
422 roundcubemail-core noarch 1.2-7.2.el7.kolab_wf Kolab_Winterfell 1.0 M
423 roundcubemail-core-assets
424 noarch 1.2-7.2.el7.kolab_wf Kolab_Winterfell 491 k
425 roundcubemail-plugin-filesystem_attachments
426 noarch 1.2-7.2.el7.kolab_wf Kolab_Winterfell 19 k
427 roundcubemail-plugin-filesystem_attachments-assets
428 noarch 1.2-7.2.el7.kolab_wf Kolab_Winterfell 14 k
429 roundcubemail-plugin-jqueryui
430 noarch 1.2-7.2.el7.kolab_wf Kolab_Winterfell 113 k
431 roundcubemail-plugin-jqueryui-assets
432 noarch 1.2-7.2.el7.kolab_wf Kolab_Winterfell 102 k
433 roundcubemail-plugin-jqueryui-skin-larry
434 noarch 1.2-7.2.el7.kolab_wf Kolab_Winterfell 19 k
435 roundcubemail-plugin-jqueryui-skin-larry-assets
436 noarch 1.2-7.2.el7.kolab_wf Kolab_Winterfell 47 k
437 roundcubemail-plugin-kolab_auth-assets
438 noarch 3.3-21.1.el7.kolab_wf Kolab_Winterfell 7.5 k
439 roundcubemail-plugin-kolab_folders-assets
440 noarch 3.3-21.1.el7.kolab_wf Kolab_Winterfell 9.1 k
441 roundcubemail-plugin-libkolab-assets
442 noarch 3.3-21.1.el7.kolab_wf Kolab_Winterfell 13 k
443 roundcubemail-plugin-libkolab-skin-larry-assets
444 noarch 3.3-21.1.el7.kolab_wf Kolab_Winterfell 11 k
445 roundcubemail-skin-larry noarch 1.2-7.2.el7.kolab_wf Kolab_Winterfell 33 k
446 roundcubemail-skin-larry-assets
447 noarch 1.2-7.2.el7.kolab_wf Kolab_Winterfell 139 k
448 svrcore x86_64 4.0.4-11.el7 base 17 k
449 t1lib x86_64 5.1.2-14.el7 base 166 k
450
451Transaction Summary
452================================================================================
453Install 3 Packages (+42 Dependent packages)
454
455Total download size: 26 M
456Installed size: 39 M
457Downloading packages:
458--------------------------------------------------------------------------------
459Total 5.8 MB/s | 26 MB 00:04
460Running transaction check
461Running transaction test
462Transaction test succeeded
463Running transaction
464 Installing : svrcore-4.0.4-11.el7.x86_64 1/45
465 Installing : roundcubemail-skin-larry-assets-1.2-7.2.el7.kolab_wf.noa 2/45
466 Installing : roundcubemail-plugin-jqueryui-assets-1.2-7.2.el7.kolab_w 3/45
467 Installing : roundcubemail-plugin-jqueryui-skin-larry-assets-1.2-7.2. 4/45
468 Installing : mozldap-6.0.5-11.3.el7.kolab_wf.x86_64 5/45
469 Installing : mozldap-tools-6.0.5-11.3.el7.kolab_wf.x86_64 6/45
470 Installing : roundcubemail-core-assets-1.2-7.2.el7.kolab_wf.noarch 7/45
471 Installing : php-pdo-5.4.16-36.el7_1.x86_64 8/45
472 Installing : php-mysqlnd-5.4.16-36.el7_1.x86_64 9/45
473 Installing : libXpm-3.5.11-3.el7.x86_64 10/45
474 Installing : roundcubemail-plugin-libkolab-assets-3.3-21.1.el7.kolab_ 11/45
475 Installing : roundcubemail-plugin-filesystem_attachments-assets-1.2-7 12/45
476 Installing : centos-logos-70.0.6-3.el7.centos.noarch 13/45
477 Installing : t1lib-5.1.2-14.el7.x86_64 14/45
478 Installing : php-gd-5.4.16-36.el7_1.x86_64 15/45
479 Installing : php-ldap-5.4.16-36.el7_1.x86_64 16/45
480 Installing : php-process-5.4.16-36.el7_1.x86_64 17/45
481 Installing : 1:php-pear-1.9.4-21.el7.noarch 18/45
482 Installing : php-pear-Net-Socket-1.0.14-1.el7.noarch 19/45
483 Installing : php-pear-Auth-SASL-1.0.6-5.el7.noarch 20/45
484 Installing : php-pear-Net-LDAP2-2.0.12-1.3.el7.kolab_wf.noarch 21/45
485 Installing : php-pear-Mail-Mime-1.10.0-1.el7.noarch 22/45
486 Installing : php-pear-MDB2-2.5.0-0.9.b5.el7.noarch 23/45
487 Installing : php-pear-MDB2-Driver-mysqli-1.5.0-0.8.b4.el7.noarch 24/45
488 Installing : php-pear-Mail-mimeDecode-1.5.5-7.el7.noarch 25/45
489 Installing : php-kolab-net-ldap3-1.0.4-3.3.el7.kolab_wf.noarch 26/45
490 Installing : php-pear-Net-Sieve-1.3.4-4.el7.noarch 27/45
491 Installing : php-pear-Net-SMTP-1.7.1-1.el7.noarch 28/45
492 Installing : php-pear-Net-IDNA2-0.1.1-10.el7.noarch 29/45
493 Installing : php-pear-DB-1.7.14-6.el7.noarch 30/45
494 Installing : gamin-0.1.10-16.el7.x86_64 31/45
495 Installing : lighttpd-1.4.39-1.el7.x86_64 32/45
496 Installing : libmcrypt-2.5.8-13.el7.x86_64 33/45
497 Installing : php-mcrypt-5.4.16-3.el7.x86_64 34/45
498 Installing : roundcubemail-skin-larry-1.2-7.2.el7.kolab_wf.noarch 35/45
499 Installing : roundcubemail-plugin-filesystem_attachments-1.2-7.2.el7. 36/45
500 Installing : roundcubemail-plugin-jqueryui-skin-larry-1.2-7.2.el7.kol 37/45
501 Installing : roundcubemail-plugin-jqueryui-1.2-7.2.el7.kolab_wf.noarc 38/45
502warning: group apache does not exist - using root
503 Installing : roundcubemail-core-1.2-7.2.el7.kolab_wf.noarch 39/45
504warning: group apache does not exist - using root
505warning: group apache does not exist - using root
506warning: group apache does not exist - using root
507warning: group apache does not exist - using root
508warning: group apache does not exist - using root
509 Installing : roundcubemail-plugin-libkolab-3.3-21.1.el7.kolab_wf.noar 40/45
510warning: group apache does not exist - using root
511 Installing : roundcubemail-plugin-libkolab-skin-larry-assets-3.3-21.1 41/45
512 Installing : roundcubemail-plugin-kolab_folders-assets-3.3-21.1.el7.k 42/45
513 Installing : roundcubemail-plugin-kolab_auth-assets-3.3-21.1.el7.kola 43/45
514 Installing : roundcubemail-plugin-kolab_auth-3.3-21.1.el7.kolab_wf.no 44/45
515warning: group apache does not exist - using root
516 Installing : roundcubemail-plugin-kolab_folders-3.3-21.1.el7.kolab_wf 45/45
517warning: group apache does not exist - using root
518ERROR: Failed to load plugin file /usr/share/roundcubemail/plugins/archive/archive.phpERROR: Failed to load plugin file /usr/share/roundcubemail/plugins/zipdownload/zipdownload.phpError 500: Specified database schema directory doesn't exist.
519 Verifying : php-pear-Net-LDAP2-2.0.12-1.3.el7.kolab_wf.noarch 1/45
520 Verifying : php-pear-Net-Sieve-1.3.4-4.el7.noarch 2/45
521 Verifying : roundcubemail-plugin-kolab_auth-assets-3.3-21.1.el7.kola 3/45
522 Verifying : roundcubemail-plugin-libkolab-skin-larry-assets-3.3-21.1 4/45
523 Verifying : roundcubemail-plugin-jqueryui-assets-1.2-7.2.el7.kolab_w 5/45
524 Verifying : roundcubemail-plugin-kolab_folders-assets-3.3-21.1.el7.k 6/45
525 Verifying : roundcubemail-plugin-kolab_auth-3.3-21.1.el7.kolab_wf.no 7/45
526 Verifying : roundcubemail-plugin-jqueryui-skin-larry-assets-1.2-7.2. 8/45
527 Verifying : mozldap-tools-6.0.5-11.3.el7.kolab_wf.x86_64 9/45
528 Verifying : libmcrypt-2.5.8-13.el7.x86_64 10/45
529 Verifying : roundcubemail-plugin-libkolab-3.3-21.1.el7.kolab_wf.noar 11/45
530 Verifying : gamin-0.1.10-16.el7.x86_64 12/45
531 Verifying : php-process-5.4.16-36.el7_1.x86_64 13/45
532 Verifying : php-ldap-5.4.16-36.el7_1.x86_64 14/45
533 Verifying : php-mysqlnd-5.4.16-36.el7_1.x86_64 15/45
534 Verifying : php-pear-Net-IDNA2-0.1.1-10.el7.noarch 16/45
535 Verifying : t1lib-5.1.2-14.el7.x86_64 17/45
536 Verifying : php-kolab-net-ldap3-1.0.4-3.3.el7.kolab_wf.noarch 18/45
537 Verifying : centos-logos-70.0.6-3.el7.centos.noarch 19/45
538 Verifying : roundcubemail-plugin-kolab_folders-3.3-21.1.el7.kolab_wf 20/45
539 Verifying : roundcubemail-plugin-jqueryui-skin-larry-1.2-7.2.el7.kol 21/45
540 Verifying : roundcubemail-skin-larry-1.2-7.2.el7.kolab_wf.noarch 22/45
541 Verifying : php-pear-Mail-Mime-1.10.0-1.el7.noarch 23/45
542 Verifying : lighttpd-1.4.39-1.el7.x86_64 24/45
543 Verifying : roundcubemail-plugin-filesystem_attachments-1.2-7.2.el7. 25/45
544 Verifying : php-pear-MDB2-2.5.0-0.9.b5.el7.noarch 26/45
545 Verifying : php-pear-Net-SMTP-1.7.1-1.el7.noarch 27/45
546 Verifying : roundcubemail-plugin-jqueryui-1.2-7.2.el7.kolab_wf.noarc 28/45
547 Verifying : roundcubemail-core-1.2-7.2.el7.kolab_wf.noarch 29/45
548 Verifying : roundcubemail-plugin-filesystem_attachments-assets-1.2-7 30/45
549 Verifying : php-pear-Mail-mimeDecode-1.5.5-7.el7.noarch 31/45
550 Verifying : roundcubemail-plugin-libkolab-assets-3.3-21.1.el7.kolab_ 32/45
551 Verifying : php-gd-5.4.16-36.el7_1.x86_64 33/45
552 Verifying : php-pear-Net-Socket-1.0.14-1.el7.noarch 34/45
553 Verifying : php-pear-DB-1.7.14-6.el7.noarch 35/45
554 Verifying : roundcubemail-skin-larry-assets-1.2-7.2.el7.kolab_wf.noa 36/45
555 Verifying : libXpm-3.5.11-3.el7.x86_64 37/45
556 Verifying : php-mcrypt-5.4.16-3.el7.x86_64 38/45
557 Verifying : php-pdo-5.4.16-36.el7_1.x86_64 39/45
558 Verifying : php-pear-MDB2-Driver-mysqli-1.5.0-0.8.b4.el7.noarch 40/45
559 Verifying : svrcore-4.0.4-11.el7.x86_64 41/45
560 Verifying : php-pear-Auth-SASL-1.0.6-5.el7.noarch 42/45
561 Verifying : mozldap-6.0.5-11.3.el7.kolab_wf.x86_64 43/45
562 Verifying : roundcubemail-core-assets-1.2-7.2.el7.kolab_wf.noarch 44/45
563 Verifying : 1:php-pear-1.9.4-21.el7.noarch 45/45
564
565Installed:
566 roundcubemail-plugin-kolab_auth.noarch 0:3.3-21.1.el7.kolab_wf
567 roundcubemail-plugin-kolab_folders.noarch 0:3.3-21.1.el7.kolab_wf
568 roundcubemail-plugin-libkolab.noarch 0:3.3-21.1.el7.kolab_wf
569
570Dependency Installed:
571 centos-logos.noarch 0:70.0.6-3.el7.centos
572 gamin.x86_64 0:0.1.10-16.el7
573 libXpm.x86_64 0:3.5.11-3.el7
574 libmcrypt.x86_64 0:2.5.8-13.el7
575 lighttpd.x86_64 0:1.4.39-1.el7
576 mozldap.x86_64 0:6.0.5-11.3.el7.kolab_wf
577 mozldap-tools.x86_64 0:6.0.5-11.3.el7.kolab_wf
578 php-gd.x86_64 0:5.4.16-36.el7_1
579 php-kolab-net-ldap3.noarch 0:1.0.4-3.3.el7.kolab_wf
580 php-ldap.x86_64 0:5.4.16-36.el7_1
581 php-mcrypt.x86_64 0:5.4.16-3.el7
582 php-mysqlnd.x86_64 0:5.4.16-36.el7_1
583 php-pdo.x86_64 0:5.4.16-36.el7_1
584 php-pear.noarch 1:1.9.4-21.el7
585 php-pear-Auth-SASL.noarch 0:1.0.6-5.el7
586 php-pear-DB.noarch 0:1.7.14-6.el7
587 php-pear-MDB2.noarch 0:2.5.0-0.9.b5.el7
588 php-pear-MDB2-Driver-mysqli.noarch 0:1.5.0-0.8.b4.el7
589 php-pear-Mail-Mime.noarch 0:1.10.0-1.el7
590 php-pear-Mail-mimeDecode.noarch 0:1.5.5-7.el7
591 php-pear-Net-IDNA2.noarch 0:0.1.1-10.el7
592 php-pear-Net-LDAP2.noarch 0:2.0.12-1.3.el7.kolab_wf
593 php-pear-Net-SMTP.noarch 0:1.7.1-1.el7
594 php-pear-Net-Sieve.noarch 0:1.3.4-4.el7
595 php-pear-Net-Socket.noarch 0:1.0.14-1.el7
596 php-process.x86_64 0:5.4.16-36.el7_1
597 roundcubemail-core.noarch 0:1.2-7.2.el7.kolab_wf
598 roundcubemail-core-assets.noarch 0:1.2-7.2.el7.kolab_wf
599 roundcubemail-plugin-filesystem_attachments.noarch 0:1.2-7.2.el7.kolab_wf
600 roundcubemail-plugin-filesystem_attachments-assets.noarch 0:1.2-7.2.el7.kolab_wf
601 roundcubemail-plugin-jqueryui.noarch 0:1.2-7.2.el7.kolab_wf
602 roundcubemail-plugin-jqueryui-assets.noarch 0:1.2-7.2.el7.kolab_wf
603 roundcubemail-plugin-jqueryui-skin-larry.noarch 0:1.2-7.2.el7.kolab_wf
604 roundcubemail-plugin-jqueryui-skin-larry-assets.noarch 0:1.2-7.2.el7.kolab_wf
605 roundcubemail-plugin-kolab_auth-assets.noarch 0:3.3-21.1.el7.kolab_wf
606 roundcubemail-plugin-kolab_folders-assets.noarch 0:3.3-21.1.el7.kolab_wf
607 roundcubemail-plugin-libkolab-assets.noarch 0:3.3-21.1.el7.kolab_wf
608 roundcubemail-plugin-libkolab-skin-larry-assets.noarch 0:3.3-21.1.el7.kolab_wf
609 roundcubemail-skin-larry.noarch 0:1.2-7.2.el7.kolab_wf
610 roundcubemail-skin-larry-assets.noarch 0:1.2-7.2.el7.kolab_wf
611 svrcore.x86_64 0:4.0.4-11.el7
612 t1lib.x86_64 0:5.1.2-14.el7
613
614Complete!
615/srv/kolab-syncroton.git /srv/kolab-syncroton.git
616Running generic_php_lint ...
617PHP 5.4.16 (cli) (built: Jun 23 2015 21:17:27)
618Copyright (c) 1997-2013 The PHP Group
619Zend Engine v2.4.0, Copyright (c) 1998-2013 Zend Technologies
620[PHP Modules]
621bz2
622calendar
623Core
624ctype
625curl
626date
627dom
628ereg
629exif
630fileinfo
631filter
632ftp
633gd
634gettext
635gmp
636hash
637iconv
638json
639ldap
640libxml
641mbstring
642mcrypt
643mhash
644mysql
645mysqli
646mysqlnd
647openssl
648pcntl
649pcre
650PDO
651pdo_mysql
652pdo_sqlite
653Phar
654posix
655readline
656Reflection
657session
658shmop
659SimpleXML
660soap
661sockets
662SPL
663sqlite3
664standard
665sysvmsg
666sysvsem
667sysvshm
668tidy
669tokenizer
670wddx
671xml
672xmlreader
673xmlwriter
674xsl
675zip
676zlib
677
678[Zend Modules]
679
680Running generic_php_lint OK (at aaa5a98f486568a7779cca3a5ee7839802673dd3)
681Running generic_js_lint ...
682Running generic_js_lint OK (at aaa5a98f486568a7779cca3a5ee7839802673dd3)
683/srv/kolab-syncroton.git
684Running ../stick.git/drydocker/kolab-syncroton/test_build.sh OK (at aaa5a98f486568a7779cca3a5ee7839802673dd3)
685Running ../stick.git/drydocker/kolab-syncroton/test_obs.sh ...
686/srv/kolab-syncroton.git /srv/kolab-syncroton.git
687Running obs_build_local ...
688/srv/kolab-syncroton.git /srv/kolab-syncroton.git /srv/kolab-syncroton.git
689++++ git branch --contains aaa5a98f486568a7779cca3a5ee7839802673dd3
690++++ sed -r -e 's/^\* //g' -e 's/^ //g'
691++++ grep -E '^(master|kolab-syncroton|[a-z0-9-]+([0-9]+\.?))'
692++++ sort --version-sort -u
693+++ branches=master
694+++ echo 'Branches that contain aaa5a98f486568a7779cca3a5ee7839802673dd3:'
695Branches that contain aaa5a98f486568a7779cca3a5ee7839802673dd3:
696+++ echo master
697+++ sed -e 's/\s/\r\n/g'
698master
699++++ echo master
700++++ sed -e 's/\s/\r\n/g'
701++++ grep -E '^master$'
702+++ '[' '!' -z master ']'
703+++ branch=master
704+++ echo 'Branch is '\''master'\'''
705Branch is 'master'
706++++ git branch -la
707++++ sed -r -e 's/^\* //g' -e 's/^ remotes\/origin\///g' -e '/^HEAD/d'
708++++ grep -E '^(kolab-syncroton|[a-z0-9-]+([0-9]+\.?))'
709++++ tail -n 1
710++++ sort --version-sort -u
711+++ latest_stable_branch=kolab-syncroton-2.2
712+++ echo 'The latest stable branch is '\''kolab-syncroton-2.2'\'''
713The latest stable branch is 'kolab-syncroton-2.2'
714+++ '[' master == master ']'
715+++ '[' '!' -z kolab-syncroton-2.2 ']'
716++++ echo kolab-syncroton-2.2
717++++ sed -r -e 's/^.*([0-9]+(\.[0-9]+)+)$/\1/g'
718++++ awk -F. '{$NF+=1; OFS="."; print $0}'
719+++ master_version=2.3
720+++ echo 'This puts the version for master at '\''2.3'\'''
721This puts the version for master at '2.3'
722+++ stable_version=0
723++++ git tag -l
724++++ grep -E '2.3(\.[0-9]+)+$'
725++++ sed -r -e 's/^.*([0-9]\.([0-9]+(\.[0-9]+)+))$/\1/g'
726++++ sort --version-sort -u
727++++ tail -n 1
728++++ awk -F. '{$NF+=1; OFS="."; print $0}'
729++++ sed -r -e 's/[^0-9\.]+//g'
730+++ tag_version=2.3.3
731+++ '[' -z 2.3.3 -a -z 2.3 ']'
732++++ echo -e '2.3\n0\n2.3.3'
733++++ sort --version-sort -u
734++++ tail -n 1
735+++ new_version=2.3.3
736+++ '[' 2.3.3 == 0 ']'
737+++ echo 'Going with new version: '\''2.3.3'\'''
738Going with new version: '2.3.3'
739+++ set - -x
740/srv /srv/kolab-syncroton.git /srv/kolab-syncroton.git
741A Kolab:Winterfell
742A Kolab:Winterfell/kolab-syncroton
743A Kolab:Winterfell/kolab-syncroton/debian.changelog
744A Kolab:Winterfell/kolab-syncroton/debian.control
745A Kolab:Winterfell/kolab-syncroton/debian.rules
746A Kolab:Winterfell/kolab-syncroton/debian.series
747A Kolab:Winterfell/kolab-syncroton/debian.tar.gz
748A Kolab:Winterfell/kolab-syncroton/kolab-syncroton-2.3.3.tar.gz
749A Kolab:Winterfell/kolab-syncroton/kolab-syncroton.dsc
750A Kolab:Winterfell/kolab-syncroton/kolab-syncroton.logrotate
751A Kolab:Winterfell/kolab-syncroton/kolab-syncroton.spec
752At revision 2.
753/srv/Kolab:Winterfell/kolab-syncroton /srv /srv/kolab-syncroton.git /srv/kolab-syncroton.git
754/srv/kolab-syncroton.git /srv/Kolab:Winterfell/kolab-syncroton /srv /srv/kolab-syncroton.git /srv/kolab-syncroton.git
755Going with new version: '2.3.3'
756About to create /srv/Kolab:Winterfell/kolab-syncroton/kolab-syncroton-2.3.3.tar.gz
757Creating /srv/Kolab:Winterfell/kolab-syncroton/kolab-syncroton-2.3.3.tar.gz completed
758total 64
759-rw-r--r--. 1 root root 7700 Feb 22 10:48 debian.changelog
760-rw-r--r--. 1 root root 820 Feb 11 2014 debian.control
761-rw-r--r--. 1 root root 700 Sep 13 2014 debian.rules
762-rw-r--r--. 1 root root 0 Oct 14 2013 debian.series
763-rw-r--r--. 1 root root 14842 Feb 12 2015 debian.tar.gz
764-rw-r--r--. 1 root root 9139 Feb 28 21:33 kolab-syncroton-2.3.3.tar.gz
765-rw-r--r--. 1 root root 546 Feb 22 10:48 kolab-syncroton.dsc
766-rw-r--r--. 1 root root 396 Sep 2 08:15 kolab-syncroton.logrotate
767-rw-r--r--. 1 root root 10323 Feb 22 10:48 kolab-syncroton.spec
768/srv/Kolab:Winterfell/kolab-syncroton /srv /srv/kolab-syncroton.git /srv/kolab-syncroton.git
769WARNING: source service from package or project will not be executed. This may not be the same build as on server!
770Building kolab-syncroton.spec for CentOS_7/x86_64
771Getting buildinfo from server and store to /srv/Kolab:Winterfell/kolab-syncroton/.osc/_buildinfo-CentOS_7-x86_64.xml
772Getting buildconfig from server and store to /srv/Kolab:Winterfell/kolab-syncroton/.osc/_buildconfig-CentOS_7-x86_64
773Updating cache of required packages
774
775The build root needs packages from project 'CentOS:7'.
776Note that malicious packages can compromise the build result or even your system.
777Would you like to ...
7780 - quit (default)
7791 - always trust packages from 'CentOS:7'
7802 - trust packages just this time
781? 0.0% cache miss. 273/273 dependencies cached.
782
783Skipping verification of package signatures
784Writing build configuration
785Running build
786mount: permission denied
787mount: permission denied
788logging output to /var/tmp/build-root/CentOS_7-x86_64/.build.log...
789[ 0s] Memory limit set to 52009716KB
790[ 0s] Using BUILD_ROOT=/var/tmp/build-root/CentOS_7-x86_64
791[ 0s] Using BUILD_ARCH=x86_64:i686:i586:i486:i386
792[ 0s]
793[ 0s]
794[ 0s] kolab.example.org started "build kolab-syncroton.spec" at Sun Feb 28 21:33:46 UTC 2016.
795[ 0s]
796[ 0s]
797[ 0s] processing recipe /srv/Kolab:Winterfell/kolab-syncroton/kolab-syncroton.spec ...
798[ 0s] running changelog2spec --target rpm --file /srv/Kolab:Winterfell/kolab-syncroton/kolab-syncroton.spec
799[ 1s] init_buildsystem --configdir /usr/lib/build/configs --cachedir /var/cache/build --rpmlist /tmp/rpmlist.ouNkr_ /srv/Kolab:Winterfell/kolab-syncroton/kolab-syncroton.spec ...
800[ 2s] cycle: glibc -> nss-softokn-freebl -> bash
801[ 2s] breaking dependency nss-softokn-freebl -> bash
802[ 2s] cycle: glibc -> nss-softokn-freebl
803[ 2s] breaking dependency glibc -> nss-softokn-freebl
804[ 2s] cycle: glibc -> libgcc -> filesystem -> bash
805[ 2s] breaking dependency filesystem -> bash
806[ 2s] cycle: filesystem -> setup
807[ 2s] breaking dependency filesystem -> setup
808[ 2s] cycle: rpm-libs -> rpm
809[ 2s] breaking dependency rpm -> rpm-libs
810[ 2s] [1/52] preinstalling filesystem...
811[ 2s] [2/52] preinstalling libgcc...
812[ 2s] [3/52] preinstalling setup...
813[ 2s] [4/52] preinstalling glibc...
814[ 3s] [5/52] preinstalling bzip2-libs...
815[ 3s] [6/52] preinstalling e2fsprogs-libs...
816[ 3s] [7/52] preinstalling elfutils-libelf...
817[ 4s] [8/52] preinstalling expat...
818[ 4s] [9/52] preinstalling libattr...
819[ 4s] [10/52] preinstalling libdb...
820[ 4s] [11/52] preinstalling nspr...
821[ 4s] [12/52] preinstalling popt...
822[ 4s] [13/52] preinstalling xz-libs...
823[ 5s] [14/52] preinstalling zlib...
824[ 5s] [15/52] preinstalling libstdc++...
825[ 5s] [16/52] preinstalling nss-softokn-freebl...
826[ 5s] [17/52] preinstalling file-libs...
827[ 5s] [18/52] preinstalling libacl...
828[ 5s] [19/52] preinstalling libcap...
829[ 6s] [20/52] preinstalling nss-util...
830[ 6s] [21/52] preinstalling attr...
831[ 6s] [22/52] preinstalling ncurses-libs...
832[ 6s] [23/52] preinstalling pcre...
833[ 6s] [24/52] preinstalling bash...
834[ 7s] [25/52] preinstalling ncurses...
835[ 7s] [26/52] preinstalling acl...
836[ 7s] [27/52] preinstalling libsepol...
837[ 7s] [28/52] preinstalling bzip2...
838[ 7s] [29/52] preinstalling info...
839[ 7s] [30/52] preinstalling diffutils...
840[ 8s] [31/52] preinstalling m4...
841[ 8s] [32/52] preinstalling grep...
842[ 8s] [33/52] preinstalling libselinux...
843[ 8s] [34/52] preinstalling readline...
844[ 8s] [35/52] preinstalling device-mapper-libs...
845[ 9s] [36/52] preinstalling lua...
846[ 9s] [37/52] preinstalling sqlite...
847[ 9s] [38/52] preinstalling chkconfig...
848[ 9s] [39/52] preinstalling findutils...
849[ 9s] [40/52] preinstalling sed...
850[ 9s] [41/52] preinstalling tar...
851[ 10s] [42/52] preinstalling coreutils...
852[ 10s] [43/52] preinstalling nss-softokn...
853[ 11s] [44/52] preinstalling pam...
854[ 11s] [45/52] preinstalling krb5-libs...
855[ 11s] [46/52] preinstalling shadow-utils...
856[ 12s] [47/52] preinstalling openssl...
857[ 12s] [48/52] preinstalling util-linux...
858[ 12s] [49/52] preinstalling nss...
859[ 13s] [50/52] preinstalling rpm...
860[ 13s] [51/52] preinstalling rpm-libs...
861[ 13s] [52/52] preinstalling rpm-sign...
862[ 13s]
863[ 13s] initializing rpm db...
864[ 14s] reordering...cycle: glibc -> basesystem -> setup -> filesystem -> bash
865[ 14s] breaking dependency glibc -> basesystem
866[ 14s] cycle: glibc -> glibc-common -> bash
867[ 14s] breaking dependency glibc-common -> bash
868[ 14s] cycle: glibc -> glibc-common
869[ 14s] breaking dependency glibc -> glibc-common
870[ 14s] cycle: glibc -> nss-softokn-freebl -> bash
871[ 14s] breaking dependency nss-softokn-freebl -> bash
872[ 14s] cycle: glibc -> nss-softokn-freebl
873[ 14s] breaking dependency glibc -> nss-softokn-freebl
874[ 14s] cycle: glibc -> libgcc -> filesystem -> bash
875[ 14s] breaking dependency filesystem -> bash
876[ 14s] cycle: filesystem -> setup
877[ 14s] breaking dependency filesystem -> setup
878[ 14s] cycle: coreutils -> openssl-libs -> ca-certificates
879[ 14s] breaking dependency coreutils -> openssl-libs
880[ 14s] cycle: perl -> perl-libs
881[ 14s] breaking dependency perl -> perl-libs
882[ 14s] cycle: perl -> perl-Carp
883[ 14s] breaking dependency perl -> perl-Carp
884[ 14s] cycle: perl -> perl-PathTools
885[ 14s] breaking dependency perl -> perl-PathTools
886[ 14s] cycle: perl -> perl-Exporter
887[ 14s] breaking dependency perl -> perl-Exporter
888[ 14s] cycle: perl -> perl-File-Path
889[ 14s] breaking dependency perl -> perl-File-Path
890[ 14s] cycle: perl -> perl-File-Temp
891[ 14s] breaking dependency perl -> perl-File-Temp
892[ 14s] cycle: perl -> perl-Filter
893[ 14s] breaking dependency perl -> perl-Filter
894[ 14s] cycle: perl -> perl-Getopt-Long
895[ 14s] breaking dependency perl -> perl-Getopt-Long
896[ 14s] cycle: perl -> perl-Pod-Simple
897[ 14s] breaking dependency perl -> perl-Pod-Simple
898[ 14s] cycle: perl -> perl-Scalar-List-Utils
899[ 14s] breaking dependency perl -> perl-Scalar-List-Utils
900[ 14s] cycle: perl -> perl-Socket
901[ 14s] breaking dependency perl -> perl-Socket
902[ 14s] cycle: perl -> perl-Storable
903[ 14s] breaking dependency perl -> perl-Storable
904[ 14s] cycle: perl -> perl-Time-HiRes
905[ 14s] breaking dependency perl -> perl-Time-HiRes
906[ 14s] cycle: perl -> perl-Time-Local
907[ 14s] breaking dependency perl -> perl-Time-Local
908[ 14s] cycle: perl -> perl-constant
909[ 14s] breaking dependency perl -> perl-constant
910[ 14s] cycle: perl -> perl-threads
911[ 14s] breaking dependency perl -> perl-threads
912[ 14s] cycle: perl -> perl-threads-shared
913[ 14s] breaking dependency perl-threads-shared -> perl
914[ 14s] cycle: perl -> perl-threads-shared -> perl-Carp
915[ 14s] breaking dependency perl-threads-shared -> perl-Carp
916[ 14s] cycle: perl -> perl-threads-shared -> perl-Scalar-List-Utils
917[ 14s] breaking dependency perl-Scalar-List-Utils -> perl
918[ 14s] cycle: perl -> perl-threads-shared -> perl-Scalar-List-Utils -> perl-Carp
919[ 14s] breaking dependency perl -> perl-threads-shared
920[ 14s] cycle: perl-macros -> perl
921[ 14s] breaking dependency perl -> perl-macros
922[ 14s] cycle: pkgconfig -> glib2 -> shared-mime-info
923[ 14s] breaking dependency glib2 -> shared-mime-info
924[ 14s] cycle: device-mapper-libs -> device-mapper
925[ 14s] breaking dependency device-mapper-libs -> device-mapper
926[ 14s] cycle: pam -> libpwquality
927[ 14s] breaking dependency pam -> libpwquality
928[ 14s] cycle: perl-Carp -> perl-Exporter
929[ 14s] breaking dependency perl-Exporter -> perl-Carp
930[ 14s] cycle: krb5-libs -> openssl-libs
931[ 14s] breaking dependency krb5-libs -> openssl-libs
932[ 14s] cycle: nss -> nss-sysinit
933[ 14s] breaking dependency nss -> nss-sysinit
934[ 14s] cycle: libcurl -> openldap -> rpm -> curl
935[ 14s] breaking dependency rpm -> curl
936[ 14s] cycle: rpm -> rpm-libs
937[ 14s] breaking dependency rpm -> rpm-libs
938[ 14s] cycle: roundcubemail-core -> roundcubemail-plugin-filesystem_attachments
939[ 14s] breaking dependency roundcubemail-core -> roundcubemail-plugin-filesystem_attachments
940[ 14s] cycle: roundcubemail-core -> roundcubemail-plugin-jqueryui
941[ 14s] breaking dependency roundcubemail-core -> roundcubemail-plugin-jqueryui
942[ 14s] cycle: roundcubemail-core -> roundcubemail-skin-larry
943[ 14s] breaking dependency roundcubemail-core -> roundcubemail-skin-larry
944[ 14s] cycle: roundcubemail-plugin-libkolab-skin-larry-assets -> roundcubemail-plugin-libkolab
945[ 14s] breaking dependency roundcubemail-plugin-libkolab -> roundcubemail-plugin-libkolab-skin-larry-assets
946[ 14s] cycle: perl-Getopt-Long -> perl-Pod-Usage
947[ 14s] breaking dependency perl-Pod-Usage -> perl-Getopt-Long
948[ 14s] cycle: perl-Getopt-Long -> perl-Pod-Usage -> perl-podlators -> perl-Encode
949[ 14s] breaking dependency perl-podlators -> perl-Encode
950[ 14s] cycle: perl-Getopt-Long -> perl-Pod-Usage -> perl-podlators
951[ 14s] breaking dependency perl-podlators -> perl-Getopt-Long
952[ 14s] cycle: perl-Getopt-Long -> perl-Pod-Usage -> perl-podlators -> perl-Pod-Simple -> perl-Encode
953[ 14s] breaking dependency perl-podlators -> perl-Pod-Simple
954[ 14s] cycle: perl-Pod-Usage -> perl-podlators
955[ 14s] breaking dependency perl-Pod-Usage -> perl-podlators
956[ 14s] cycle: perl-Getopt-Long -> perl-Pod-Usage -> perl-Pod-Perldoc -> perl-Encode
957[ 14s] breaking dependency perl-Pod-Perldoc -> perl-Encode
958[ 14s] cycle: perl-Pod-Usage -> perl-Pod-Perldoc -> perl-podlators
959[ 14s] breaking dependency perl-Pod-Perldoc -> perl-podlators
960[ 14s] cycle: perl-Getopt-Long -> perl-Pod-Usage -> perl-Pod-Perldoc -> perl-Pod-Simple -> perl-Encode
961[ 14s] breaking dependency perl-Pod-Perldoc -> perl-Pod-Simple
962[ 14s] cycle: git -> perl-Git
963[ 14s] breaking dependency git -> perl-Git
964[ 14s] cycle: kmod -> dracut
965[ 14s] breaking dependency dracut -> kmod
966[ 14s] done
967[ 15s] [1/273] installing bind-license-32:9.9.4-29.el7_2.2
968[ 15s] [2/273] installing centos-release-7-2.1511.el7.centos.2.10
969[ 15s] [3/273] installing gettext-common-devel-0.18.2.1-4.el7
970[ 15s] [4/273] installing kernel-headers-3.10.0-327.10.1.el7
971[ 16s] [5/273] installing libX11-common-1.6.3-2.el7
972[ 16s] [6/273] installing ncurses-base-5.9-13.20130511.el7
973[ 16s] [7/273] installing perl-srpm-macros-1-8.el7
974[ 16s] [8/273] installing roundcubemail-core-assets-1.2-7.2.el7.kolab_wf
975[ 17s] [9/273] installing roundcubemail-plugin-filesystem_attachments-assets-1.2-7.2.el7.kolab_wf
976[ 17s] [10/273] installing roundcubemail-plugin-jqueryui-assets-1.2-7.2.el7.kolab_wf
977[ 17s] [11/273] installing roundcubemail-plugin-kolab_auth-assets-3.3-21.1.el7.kolab_wf
978[ 17s] [12/273] installing roundcubemail-plugin-kolab_folders-assets-3.3-21.1.el7.kolab_wf
979[ 17s] [13/273] installing roundcubemail-plugin-libkolab-assets-3.3-21.1.el7.kolab_wf
980[ 17s] [14/273] installing roundcubemail-skin-larry-assets-1.2-7.2.el7.kolab_wf
981[ 18s] [15/273] installing systemd-sysv-219-19.el7_2.4
982[ 18s] [16/273] installing tzdata-2016a-1.el7
983[ 18s] [17/273] installing filesystem-3.2-20.el7
984[ 19s] [18/273] installing libgcc-4.8.5-4.el7
985[ 19s] [19/273] installing vim-filesystem-2:7.4.160-1.el7
986[ 19s] [20/273] installing setup-2.8.71-6.el7
987[ 19s] [21/273] installing basesystem-10.0-7.el7.centos
988[ 19s] [22/273] installing glibc-2.17-106.el7_2.4
989[ 20s] [23/273] installing SDL-1.2.15-14.el7
990[ 21s] [24/273] installing audit-libs-2.4.1-5.el7
991[ 21s] [25/273] installing bzip2-libs-1.0.6-13.el7
992[ 21s] [26/273] installing dbus-libs-1:1.6.12-13.el7
993[ 22s] [27/273] installing elfutils-libelf-0.163-3.el7
994[ 22s] [28/273] installing expat-2.1.0-8.el7
995[ 22s] [29/273] installing fipscheck-lib-1.4.1-5.el7
996[ 23s] [30/273] installing gdbm-1.10-8.el7
997[ 23s] [31/273] installing hardlink-1:1.0-19.el7
998[ 23s] [32/273] installing hostname-3.13-3.el7
999[ 23s] [33/273] installing keyutils-libs-1.5.8-3.el7
1000[ 23s] [34/273] installing libXau-1.0.8-2.1.el7
1001[ 24s] [35/273] installing libattr-2.4.46-12.el7
1002[ 24s] [36/273] installing libcap-ng-0.7.5-4.el7
1003[ 24s] [37/273] installing libcom_err-1.42.9-7.el7
1004[ 25s] [38/273] installing libdb-5.3.21-19.el7
1005[ 25s] [39/273] installing libffi-3.0.13-16.el7
1006[ 25s] [40/273] installing libgpg-error-1.12-3.el7
1007[ 26s] [41/273] installing libjpeg-turbo-1.2.90-5.el7
1008[ 26s] [42/273] installing libmcrypt-2.5.8-13.el7
1009[ 26s] [43/273] installing libmnl-1.0.3-7.el7
1010[ 27s] [44/273] installing libnfnetlink-1.0.1-4.el7
1011[ 27s] [45/273] installing libpipeline-1.2.3-3.el7
1012[ 27s] [46/273] installing libtasn1-3.8-2.el7
1013[ 28s] [47/273] installing libuuid-2.23.2-26.el7
1014[ 28s] [48/273] installing libverto-0.2.5-4.el7
1015[ 28s] [49/273] installing nspr-4.10.8-2.el7_1
1016[ 28s] [50/273] installing popt-1.13-16.el7
1017[ 29s] [51/273] installing sysvinit-tools-2.88-14.dsf.el7
1018[ 29s] [52/273] installing ustr-1.0.4-16.el7
1019[ 29s] [53/273] installing xz-libs-5.1.2-12alpha.el7
1020[ 29s] [54/273] installing zlib-1.2.7-15.el7
1021[ 30s] [55/273] installing libstdc++-4.8.5-4.el7
1022[ 30s] [56/273] installing nss-softokn-freebl-3.16.2.3-13.el7_1
1023[ 30s] [57/273] installing bzip2-devel-1.0.6-13.el7
1024[ 31s] [58/273] installing libstdc++-devel-4.8.5-4.el7
1025[ 31s] [59/273] installing cyrus-sasl-lib-2.1.26-20.el7_2
1026[ 31s] [60/273] installing dwz-0.11-3.el7
1027[ 32s] [61/273] installing e2fsprogs-libs-1.42.9-7.el7
1028[ 32s] [62/273] installing file-libs-5.11-31.el7
1029[ 32s] [63/273] installing libacl-2.2.51-12.el7
1030[ 33s] [64/273] installing libcap-2.22-8.el7
1031[ 33s] [65/273] installing libgcrypt-1.5.3-12.el7_1.1
1032[ 33s] [66/273] installing libpng-2:1.5.13-7.el7_2
1033[ 34s] [67/273] installing libss-1.42.9-7.el7
1034[ 34s] [68/273] installing libxcb-1.11-4.el7
1035[ 34s] [69/273] installing libzip-0.10.1-8.el7
1036[ 35s] [70/273] installing nss-util-3.19.1-4.el7_1
1037[ 35s] [71/273] installing p11-kit-0.20.7-3.el7
1038[ 35s] [72/273] installing zip-3.0-10.el7
1039[ 35s] [73/273] installing attr-2.4.46-12.el7
1040[ 36s] [74/273] installing gmp-1:6.0.0-12.el7_1
1041[ 36s] [75/273] installing libnetfilter_conntrack-1.0.4-2.el7
1042[ 36s] [76/273] installing libxml2-2.9.1-6.el7_2.2
1043[ 37s] [77/273] installing pcre-8.32-15.el7
1044[ 37s] [78/273] installing ncurses-libs-5.9-13.20130511.el7
1045[ 37s] [79/273] installing elfutils-libs-0.163-3.el7
1046[ 38s] [80/273] installing perl-4:5.16.3-286.el7
1047[ 39s] [81/273] installing perl-macros-4:5.16.3-286.el7
1048[ 40s] [82/273] installing perl-parent-1:0.225-244.el7
1049[ 40s] [83/273] installing bash-4.2.46-19.el7
1050[ 40s] [84/273] installing gpm-libs-1.20.7-5.el7
1051[ 40s] [85/273] installing libedit-3.0-12.20121213cvs.el7
1052[ 41s] [86/273] installing mpfr-3.1.1-4.el7
1053[ 41s] [87/273] installing ncurses-5.9-13.20130511.el7
1054[ 41s] [88/273] installing perl-Exporter-5.68-3.el7
1055[ 41s] [89/273] installing perl-libs-4:5.16.3-286.el7
1056[ 42s] [90/273] installing file-5.11-31.el7
1057[ 42s] [91/273] installing libX11-1.6.3-2.el7
1058[ 42s] [92/273] installing acl-2.2.51-12.el7
1059[ 43s] [93/273] installing libxslt-1.1.28-5.el7
1060[ 43s] [94/273] installing freetype-2.4.11-11.el7
1061[ 43s] [95/273] installing libXpm-3.5.11-3.el7
1062[ 44s] [96/273] installing libsepol-2.1.9-3.el7
1063[ 44s] [97/273] installing perl-Carp-1.26-244.el7
1064[ 44s] [98/273] installing perl-Pod-Escapes-1:1.04-286.el7
1065[ 44s] [99/273] installing perl-Text-Unidecode-0.04-20.el7
1066[ 44s] [100/273] installing strace-4.8-11.el7
1067[ 45s] [101/273] installing bzip2-1.0.6-13.el7
1068[ 45s] [102/273] installing glibc-headers-2.17-106.el7_2.4
1069[ 45s] [103/273] installing libmpc-1.0.1-3.el7
1070[ 46s] [104/273] installing unzip-6.0-15.el7
1071[ 46s] [105/273] installing vim-common-2:7.4.160-1.el7
1072[ 47s] [106/273] installing xz-5.1.2-12alpha.el7
1073[ 48s] [107/273] installing info-5.1-4.el7
1074[ 48s] [108/273] installing iptables-1.4.21-16.el7
1075[ 49s] [109/273] installing rsync-3.0.9-17.el7
1076[ 49s] [110/273] installing elfutils-0.163-3.el7
1077[ 49s] [111/273] installing libunistring-0.9.3-9.el7
1078[ 50s] [112/273] installing perl-constant-1.27-2.el7
1079[ 50s] [113/273] installing cpio-2.11-24.el7
1080[ 50s] [114/273] installing diffutils-3.3-4.el7
1081[ 51s] [115/273] installing gawk-4.0.2-4.el7
1082[ 51s] [116/273] installing gdbm-devel-1.10-8.el7
1083[ 51s] [117/273] installing libgomp-4.8.5-4.el7
1084[ 52s] [118/273] installing libidn-1.28-4.el7
1085[ 52s] [119/273] installing m4-1.4.16-10.el7
1086[ 52s] [120/273] installing make-1:3.82-21.el7
1087[ 53s] [121/273] installing perl-Digest-1.17-245.el7
1088[ 53s] [122/273] installing perl-Text-ParseWords-3.29-4.el7
1089[ 53s] [123/273] installing perl-threads-1.87-4.el7
1090[ 53s] [124/273] installing which-2.20-7.el7
1091[ 53s] [125/273] installing glibc-devel-2.17-106.el7_2.4
1092[ 54s] [126/273] installing grep-2.20-2.el7
1093[ 54s] [127/273] installing libselinux-2.2.2-6.el7
1094[ 55s] [128/273] installing perl-Filter-1.49-3.el7
1095[ 55s] [129/273] installing perl-Scalar-List-Utils-1.27-248.el7
1096[ 55s] [130/273] installing perl-Socket-2.010-3.el7
1097[ 55s] [131/273] installing perl-Storable-2.45-3.el7
1098[ 55s] [132/273] installing perl-TermReadKey-2.30-20.el7
1099[ 55s] [133/273] installing perl-Time-HiRes-4:1.9725-3.el7
1100[ 56s] [134/273] installing readline-6.2-9.el7
1101[ 56s] [135/273] installing cpp-4.8.5-4.el7
1102[ 57s] [136/273] installing lua-5.1.4-14.el7
1103[ 58s] [137/273] installing net-tools-2.0-0.17.20131004git.el7
1104[ 58s] [138/273] installing patch-2.7.1-8.el7
1105[ 58s] [139/273] installing psmisc-22.20-9.el7
1106[ 58s] [140/273] installing sqlite-3.7.17-8.el7
1107[ 59s] [141/273] installing bison-2.7-4.el7
1108[ 59s] [142/273] installing chkconfig-1.3.61-5.el7
1109[ 59s] [143/273] installing findutils-1:4.5.11-5.el7
1110[ 60s] [144/273] installing flex-2.5.37-3.el7
1111[ 60s] [145/273] installing glibc-common-2.17-106.el7_2.4
1112[ 68s] [146/273] installing linuxconsoletools-1.4.5-3.el7
1113[ 68s] [147/273] installing perl-Digest-MD5-2.52-3.el7
1114[ 68s] [148/273] installing perl-Error-1:0.17020-2.el7
1115[ 68s] [149/273] installing perl-Time-Local-1.2300-2.el7
1116[ 68s] [150/273] installing rcs-5.9.0-5.el7
1117[ 69s] [151/273] installing sed-4.2.2-5.el7
1118[ 69s] [152/273] installing vim-minimal-2:7.4.160-1.el7
1119[ 69s] [153/273] installing iproute-3.10.0-54.el7
1120[ 70s] [154/273] installing perl-PathTools-3.40-5.el7
1121[ 70s] [155/273] installing perl-threads-shared-1.43-6.el7
1122[ 70s] [156/273] installing tar-2:1.26-29.el7
1123[ 70s] [157/273] installing glib2-2.42.2-5.el7
1124[ 71s] [158/273] installing libsemanage-2.1.10-18.el7
1125[ 72s] [159/273] installing perl-Data-Dumper-2.145-3.el7
1126[ 72s] [160/273] installing vim-enhanced-2:7.4.160-1.el7
1127[ 72s] [161/273] installing coreutils-8.22-15.el7_2.1
1128[ 73s] [162/273] installing pkgconfig-1:0.27.1-4.el7
1129[ 74s] [163/273] installing libcroco-0.6.8-5.el7
1130[ 74s] [164/273] installing perl-HTTP-Tiny-0.033-3.el7
1131[ 74s] [165/273] installing gzip-1.5-8.el7
1132[ 74s] [166/273] installing libblkid-2.23.2-26.el7
1133[ 75s] [167/273] installing libgnome-keyring-3.8.0-3.el7
1134[ 75s] [168/273] installing perl-File-Path-2.09-2.el7
1135[ 75s] [169/273] installing perl-Thread-Queue-3.02-2.el7
1136[ 75s] [170/273] installing groff-base-1.22.2-8.el7
1137[ 76s] [171/273] installing nss-softokn-3.16.2.3-13.el7_1
1138[ 76s] [172/273] installing t1lib-5.1.2-14.el7
1139[ 76s] [173/273] installing binutils-2.23.52.0.1-55.el7
1140[ 78s] [174/273] installing gpm-1.20.7-5.el7
1141[ 78s] [175/273] installing p11-kit-trust-0.20.7-3.el7
1142[ 79s] [176/273] installing shadow-utils-2:4.1.5.1-18.el7
1143[ 79s] [177/273] installing krb5-libs-1.13.2-10.el7
1144[ 80s] [178/273] installing expat-devel-2.1.0-8.el7
1145[ 80s] [179/273] installing zlib-devel-1.2.7-15.el7
1146[ 80s] [180/273] installing libutempter-1.1.6-4.el7
1147[ 81s] [181/273] installing ncurses-devel-5.9-13.20130511.el7
1148[ 81s] [182/273] installing ca-certificates-2015.2.6-70.1.el7_2
1149[ 83s] [183/273] installing cracklib-2.9.0-11.el7
1150[ 83s] [184/273] installing less-458-9.el7
1151[ 83s] [185/273] installing libmount-2.23.2-26.el7
1152[ 84s] [186/273] installing shared-mime-info-1.1-9.el7
1153[ 85s] [187/273] installing e2fsprogs-1.42.9-7.el7
1154[ 85s] [188/273] installing perl-File-Temp-0.23.01-3.el7
1155[ 85s] [189/273] installing gettext-libs-0.18.2.1-4.el7
1156[ 85s] [190/273] installing nss-3.19.1-19.el7_2
1157[ 86s] [191/273] installing gcc-4.8.5-4.el7
1158[ 88s] [192/273] installing cracklib-dicts-2.9.0-11.el7
1159[ 89s] [193/273] installing svrcore-4.0.4-11.el7
1160[ 89s] [194/273] installing openssl-libs-1:1.0.1e-51.el7_2.2
1161[ 89s] [195/273] installing nss-tools-3.19.1-19.el7_2
1162[ 90s] [196/273] installing nss-sysinit-3.19.1-19.el7_2
1163[ 90s] [197/273] installing gcc-c++-4.8.5-4.el7
1164[ 91s] [198/273] installing gettext-0.18.2.1-4.el7
1165[ 91s] [199/273] installing man-db-2.6.3-9.el7
1166[ 92s] [200/273] installing perl-Pod-Perldoc-3.20-4.el7
1167[ 92s] [201/273] installing rpm-4.11.3-17.el7
1168[ 92s] [202/273] installing libssh2-1.4.3-10.el7
1169[ 93s] [203/273] installing perl-Pod-Usage-1.63-3.el7
1170[ 93s] [204/273] installing bind-libs-32:9.9.4-29.el7_2.2
1171[ 93s] [205/273] installing mozldap-6.0.5-11.3.el7.kolab_wf
1172[ 94s] [206/273] installing openssl-1:1.0.1e-51.el7_2.2
1173[ 94s] [207/273] installing pam-1.1.8-12.el7_1.1
1174[ 94s] [208/273] installing openldap-2.4.40-8.el7
1175[ 95s] [209/273] installing rpm-libs-4.11.3-17.el7
1176[ 95s] [210/273] installing libpwquality-1.2.3-4.el7
1177[ 95s] [211/273] installing perl-Getopt-Long-2.40-2.el7
1178[ 96s] [212/273] installing libuser-0.60-7.el7_1
1179[ 96s] [213/273] installing cvs-1.11.23-35.el7
1180[ 97s] [214/273] installing perl-podlators-2.5.1-3.el7
1181[ 97s] [215/273] installing bind-utils-32:9.9.4-29.el7_2.2
1182[ 97s] [216/273] installing systemd-libs-219-19.el7_2.4
1183[ 97s] [217/273] installing libcurl-7.29.0-25.el7.centos
1184[ 98s] [218/273] installing mozldap-tools-6.0.5-11.3.el7.kolab_wf
1185[ 98s] [219/273] installing rpm-build-libs-4.11.3-17.el7
1186[ 98s] [220/273] installing php-common-5.4.16-36.el7_1
1187[ 98s] [221/273] installing procps-ng-3.3.10-5.el7_2
1188[ 99s] [222/273] installing device-mapper-libs-7:1.02.107-5.el7_2.1
1189[ 99s] [223/273] installing curl-7.29.0-25.el7.centos
1190[ 99s] [224/273] installing perl-Encode-2.51-7.el7
1191[ 100s] [225/273] installing perl-Test-Harness-3.28-3.el7
1192[ 100s] [226/273] installing redhat-rpm-config-9.1.0-68.el7.centos
1193[ 100s] [227/273] installing autoconf-2.69-11.el7
1194[ 101s] [228/273] installing rpm-sign-4.11.3-17.el7
1195[ 101s] [229/273] installing util-linux-2.23.2-26.el7
1196[ 102s] [230/273] installing kpartx-0.4.9-85.el7
1197[ 102s] [231/273] installing php-mbstring-5.4.16-36.el7_1
1198[ 102s] [232/273] installing php-process-5.4.16-36.el7_1
1199[ 102s] [233/273] installing php-mcrypt-5.4.16-3.el7
1200[ 102s] [234/273] installing device-mapper-7:1.02.107-5.el7_2.1
1201[ 103s] [235/273] installing php-ldap-5.4.16-36.el7_1
1202[ 103s] [236/273] installing php-xml-5.4.16-36.el7_1
1203[ 103s] [237/273] installing perl-Pod-Simple-1:3.28-4.el7
1204[ 103s] [238/273] installing perl-libintl-1.20-12.el7
1205[ 104s] [239/273] installing openssh-6.6.1p1-23.el7_2
1206[ 104s] [240/273] installing php-gd-5.4.16-36.el7_1
1207[ 104s] [241/273] installing automake-1.13.4-3.el7
1208[ 105s] [242/273] installing php-cli-5.4.16-36.el7_1
1209[ 106s] [243/273] installing rpm-build-4.11.3-17.el7
1210[ 106s] [244/273] installing php-pear-1:1.9.4-21.el7
1211[ 106s] No entry for terminal type "unknown";
1212[ 106s] using dumb terminal settings.
1213[ 106s] No entry for terminal type "unknown";
1214[ 106s] using dumb terminal settings.
1215[ 106s] No entry for terminal type "unknown";
1216[ 106s] using dumb terminal settings.
1217[ 107s] [245/273] installing libtool-2.4.2-21.el7_2
1218[ 107s] [246/273] installing openssh-clients-6.6.1p1-23.el7_2
1219[ 107s] [247/273] installing texinfo-5.1-4.el7
1220[ 108s] [248/273] installing dracut-033-360.el7_2
1221[ 108s] [249/273] installing php-pear-Auth-SASL-1.0.6-5.el7
1222[ 108s] No entry for terminal type "unknown";
1223[ 108s] using dumb terminal settings.
1224[ 108s] [250/273] installing php-pear-DB-1.7.14-6.el7
1225[ 108s] No entry for terminal type "unknown";
1226[ 108s] using dumb terminal settings.
1227[ 108s] [251/273] installing php-pear-Net-LDAP2-2.0.12-1.3.el7.kolab_wf
1228[ 109s] No entry for terminal type "unknown";
1229[ 109s] using dumb terminal settings.
1230[ 109s] [252/273] installing php-pear-Net-Socket-1.0.14-1.el7
1231[ 109s] No entry for terminal type "unknown";
1232[ 109s] using dumb terminal settings.
1233[ 109s] [253/273] installing php-pear-MDB2-2.5.0-0.9.b5.el7
1234[ 110s] No entry for terminal type "unknown";
1235[ 110s] using dumb terminal settings.
1236[ 110s] [254/273] installing php-pear-Net-IDNA2-0.1.1-10.el7
1237[ 110s] No entry for terminal type "unknown";
1238[ 110s] using dumb terminal settings.
1239[ 110s] [255/273] installing php-pear-Mail-Mime-1.10.0-1.el7
1240[ 110s] No entry for terminal type "unknown";
1241[ 110s] using dumb terminal settings.
1242[ 110s] [256/273] installing kmod-20-5.el7
1243[ 110s] [257/273] installing git-1.8.3.1-6.el7
1244[ 112s] [258/273] installing php-kolab-net-ldap3-1.0.4-3.3.el7.kolab_wf
1245[ 112s] [259/273] installing php-pear-Mail-mimeDecode-1.5.5-7.el7
1246[ 112s] No entry for terminal type "unknown";
1247[ 112s] using dumb terminal settings.
1248[ 112s] [260/273] installing php-pear-MDB2-Driver-mysqli-1.5.0-0.8.b4.el7
1249[ 113s] No entry for terminal type "unknown";
1250[ 113s] using dumb terminal settings.
1251[ 113s] [261/273] installing php-pear-Net-Sieve-1.3.4-4.el7
1252[ 113s] No entry for terminal type "unknown";
1253[ 113s] using dumb terminal settings.
1254[ 113s] [262/273] installing php-pear-Net-SMTP-1.7.1-1.el7
1255[ 113s] No entry for terminal type "unknown";
1256[ 113s] using dumb terminal settings.
1257[ 113s] [263/273] installing gettext-devel-0.18.2.1-4.el7
1258[ 114s] [264/273] installing perl-Git-1.8.3.1-6.el7
1259[ 114s] [265/273] installing initscripts-9.49.30-1.el7
1260[ 114s] [266/273] installing roundcubemail-core-1.2-7.2.el7.kolab_wf
1261[ 115s] warning: group apache does not exist - using root
1262[ 115s] warning: group apache does not exist - using root
1263[ 115s] warning: group apache does not exist - using root
1264[ 115s] warning: group apache does not exist - using root
1265[ 115s] warning: group apache does not exist - using root
1266[ 115s] No entry for terminal type "unknown";
1267[ 115s] using dumb terminal settings.
1268[ 115s] ERROR: Failed to load plugin file /usr/share/roundcubemail/plugins/archive/archive.phpERROR: Failed to load plugin file /usr/share/roundcubemail/plugins/zipdownload/zipdownload.phpERROR: Failed to load plugin file /usr/share/roundcubemail/plugins/filesystem_attachments/filesystem_attachments.phpERROR: Requried plugin filesystem_attachments was not loaded
1269[ 115s] [267/273] installing roundcubemail-skin-larry-1.2-7.2.el7.kolab_wf
1270[ 115s] [268/273] installing roundcubemail-plugin-filesystem_attachments-1.2-7.2.el7.kolab_wf
1271[ 115s] [269/273] installing roundcubemail-plugin-jqueryui-1.2-7.2.el7.kolab_wf
1272[ 116s] warning: group apache does not exist - using root
1273[ 116s] [270/273] installing roundcubemail-plugin-kolab_auth-3.3-21.1.el7.kolab_wf
1274[ 116s] warning: group apache does not exist - using root
1275[ 116s] [271/273] installing roundcubemail-plugin-libkolab-3.3-21.1.el7.kolab_wf
1276[ 117s] warning: group apache does not exist - using root
1277[ 117s] [272/273] installing roundcubemail-plugin-libkolab-skin-larry-assets-3.3-21.1.el7.kolab_wf
1278[ 117s] [273/273] installing roundcubemail-plugin-kolab_folders-3.3-21.1.el7.kolab_wf
1279[ 117s] warning: group apache does not exist - using root
1280[ 117s] removing nis flags from /var/tmp/build-root/CentOS_7-x86_64/etc/nsswitch.conf...
1281[ 117s] now finalizing build dir...
1282[ 117s] mount: permission denied
1283[ 117s] mount: permission denied
1284[ 118s] -----------------------------------------------------------------
1285[ 118s] ----- building kolab-syncroton.spec (user abuild)
1286[ 118s] -----------------------------------------------------------------
1287[ 118s] -----------------------------------------------------------------
1288[ 118s] + exec rpmbuild -ba --define '_srcdefattr (-,root,root)' --nosignature /home/abuild/rpmbuild/SOURCES/kolab-syncroton.spec
1289[ 118s] warning: bogus date in %changelog: Wed Sep 3 2013 Jeroen van Meeuwen <vanmeeuwen@kolabsys.com> - 2.1.0-1
1290[ 118s] Executing(%prep): /bin/sh -e /var/tmp/rpm-tmp.3vECHl
1291[ 118s] + umask 022
1292[ 118s] + cd /home/abuild/rpmbuild/BUILD
1293[ 118s] + cd /home/abuild/rpmbuild/BUILD
1294[ 118s] + rm -rf kolab-syncroton-2.3.3
1295[ 118s] + /usr/bin/gzip -dc /home/abuild/rpmbuild/SOURCES/kolab-syncroton-2.3.3.tar.gz
1296[ 118s] + /usr/bin/tar -xf -
1297[ 118s] + STATUS=0
1298[ 118s] + '[' 0 -ne 0 ']'
1299[ 118s] + cd kolab-syncroton-2.3.3
1300[ 118s] + /usr/bin/chmod -Rf a+rX,u+w,g-w,o-w .
1301[ 118s] + rm -rf lib/ext/Auth/ lib/ext/MDB2/ lib/ext/MDB2.php lib/ext/Net/IDNA2/ lib/ext/Net/IDNA2.php lib/ext/Net/SMTP.php lib/ext/Net/Socket.php lib/ext/Roundcube/ lib/ext/Zend/ lib/plugins/
1302[ 118s] + exit 0
1303[ 118s] Executing(%build): /bin/sh -e /var/tmp/rpm-tmp.7eNBac
1304[ 118s] + umask 022
1305[ 118s] + cd /home/abuild/rpmbuild/BUILD
1306[ 118s] + cd kolab-syncroton-2.3.3
1307[ 118s] + exit 0
1308[ 118s] Executing(%install): /bin/sh -e /var/tmp/rpm-tmp.en2XD2
1309[ 118s] + umask 022
1310[ 118s] + cd /home/abuild/rpmbuild/BUILD
1311[ 118s] + '[' /home/abuild/rpmbuild/BUILDROOT/kolab-syncroton-2.3.3-0.20160228.git.el7.x86_64 '!=' / ']'
1312[ 118s] + rm -rf /home/abuild/rpmbuild/BUILDROOT/kolab-syncroton-2.3.3-0.20160228.git.el7.x86_64
1313[ 118s] ++ dirname /home/abuild/rpmbuild/BUILDROOT/kolab-syncroton-2.3.3-0.20160228.git.el7.x86_64
1314[ 118s] + mkdir -p /home/abuild/rpmbuild/BUILDROOT
1315[ 118s] + mkdir /home/abuild/rpmbuild/BUILDROOT/kolab-syncroton-2.3.3-0.20160228.git.el7.x86_64
1316[ 118s] + cd kolab-syncroton-2.3.3
1317[ 118s] + mkdir -p /home/abuild/rpmbuild/BUILDROOT/kolab-syncroton-2.3.3-0.20160228.git.el7.x86_64//usr/share/kolab-syncroton /home/abuild/rpmbuild/BUILDROOT/kolab-syncroton-2.3.3-0.20160228.git.el7.x86_64//etc/httpd/conf.d/ /home/abuild/rpmbuild/BUILDROOT/kolab-syncroton-2.3.3-0.20160228.git.el7.x86_64//etc/kolab-syncroton /home/abuild/rpmbuild/BUILDROOT/kolab-syncroton-2.3.3-0.20160228.git.el7.x86_64//var/log/kolab-syncroton
1318[ 118s] + mkdir -p /home/abuild/rpmbuild/BUILDROOT/kolab-syncroton-2.3.3-0.20160228.git.el7.x86_64/etc/logrotate.d
1319[ 118s] + cp -pr /home/abuild/rpmbuild/SOURCES/kolab-syncroton.logrotate /home/abuild/rpmbuild/BUILDROOT/kolab-syncroton-2.3.3-0.20160228.git.el7.x86_64/etc/logrotate.d/kolab-syncroton
1320[ 118s] + cp -a lib /home/abuild/rpmbuild/BUILDROOT/kolab-syncroton-2.3.3-0.20160228.git.el7.x86_64//usr/share/kolab-syncroton/.
1321[ 118s] cp: cannot stat 'lib': No such file or directory
1322[ 118s] error: Bad exit status from /var/tmp/rpm-tmp.en2XD2 (%install)
1323[ 118s]
1324[ 118s]
1325[ 118s] RPM build errors:
1326[ 118s] bogus date in %changelog: Wed Sep 3 2013 Jeroen van Meeuwen <vanmeeuwen@kolabsys.com> - 2.1.0-1
1327[ 118s] Bad exit status from /var/tmp/rpm-tmp.en2XD2 (%install)
1328
1329The buildroot was: /var/tmp/build-root/CentOS_7-x86_64
1330/srv /srv/kolab-syncroton.git /srv/kolab-syncroton.git
1331/srv/kolab-syncroton.git /srv/kolab-syncroton.git
1332Running obs_build_local FAILED (at aaa5a98f486568a7779cca3a5ee7839802673dd3)
1333Running ../stick.git/drydocker/kolab-syncroton/test_obs.sh FAILED (at aaa5a98f486568a7779cca3a5ee7839802673dd3)
1334========================================================================
1335 Running 'generic_php_lint' OK (at aaa5a98f486568a7779cca3a5ee7839802673dd3)
1336 Running 'generic_js_lint' OK (at aaa5a98f486568a7779cca3a5ee7839802673dd3)
1337 Running '../stick.git/drydocker/kolab-syncroton/test_build.sh' OK (at aaa5a98f486568a7779cca3a5ee7839802673dd3)
1338 Running 'obs_build_local' FAILED (at aaa5a98f486568a7779cca3a5ee7839802673dd3)
1339 Running '../stick.git/drydocker/kolab-syncroton/test_obs.sh' FAILED (at aaa5a98f486568a7779cca3a5ee7839802673dd3)
1340========================================================================
1341/var/drydock/workingcopy-54/repo/syncroton
1342

Lease Working Copy

When
Completed at Feb 28 2016, 10:32 PM · Built instantly
Status
Passed

Wait for Previous Commits to Build

When
Completed at Feb 28 2016, 10:32 PM · Built instantly
Status
Passed

Build Log 9338 (waiting - blockers)
25 - 50 - 100 - Unlimited Lines

1Blocked by: Build 2918
2Blocked by: Build 2918
3Blocked by: Build 2918
4Blocked by: Build 2918
5Blocked by: Build 2918
6Blocked by: Build 2918
7Blocked by: Build 2918
8Blocked by: Build 2918
9Blocked by: Build 2918
10Blocked by: Build 2918
11Blocked by: Build 2918
12Blocked by: Build 2918
13Blocked by: Build 2918
14Blocked by: Build 2918
15Blocked by: Build 2918
16Blocked by: Build 2918
17Blocked by: Build 2918
18Blocked by: Build 2918
19Blocked by: Build 2918
20Blocked by: Build 2918
21Blocked by: Build 2918
22Blocked by: Build 2918
23Blocked by: Build 2918
24Blocked by: Build 2918
25Blocked by: Build 2918
26Blocked by: Build 2918
27Blocked by: Build 2918
28Blocked by: Build 2918
29Blocked by: Build 2918
30Blocked by: Build 2918
31Blocked by: Build 2918
32Blocked by: Build 2918
33Blocked by: Build 2918
34Blocked by: Build 2918
35Blocked by: Build 2918
36Blocked by: Build 2918
37Blocked by: Build 2918
38Blocked by: Build 2918
39Blocked by: Build 2918
40Blocked by: Build 2918
41Blocked by: Build 2918
42Blocked by: Build 2918
43Blocked by: Build 2918
44Blocked by: Build 2918
45Blocked by: Build 2918
46Blocked by: Build 2918
47Blocked by: Build 2918
48Blocked by: Build 2918
49Blocked by: Build 2918
50Blocked by: Build 2918
51Blocked by: Build 2918
52Blocked by: Build 2918
53Blocked by: Build 2918
54Blocked by: Build 2918
55Blocked by: Build 2918
56Blocked by: Build 2918
57Blocked by: Build 2918
58Blocked by: Build 2918
59Blocked by: Build 2918
60Blocked by: Build 2918
61Blocked by: Build 2918
62Blocked by: Build 2918
63Blocked by: Build 2918
64Blocked by: Build 2918
65Blocked by: Build 2918
66Blocked by: Build 2918
67Blocked by: Build 2918
68Blocked by: Build 2918
69Blocked by: Build 2918
70Blocked by: Build 2918
71Blocked by: Build 2918
72Blocked by: Build 2918
73Blocked by: Build 2918
74Blocked by: Build 2918
75Blocked by: Build 2918
76Blocked by: Build 2918
77Blocked by: Build 2918
78Blocked by: Build 2918
79Blocked by: Build 2918
80Blocked by: Build 2918
81Blocked by: Build 2918
82Blocked by: Build 2918
83Blocked by: Build 2918
84Blocked by: Build 2918
85Blocked by: Build 2918
86Blocked by: Build 2918
87Blocked by: Build 2918
88Blocked by: Build 2918
89Blocked by: Build 2918
90Blocked by: Build 2918
91Blocked by: Build 2918
92Blocked by: Build 2918
93Blocked by: Build 2918
94Blocked by: Build 2918
95Blocked by: Build 2918
96Blocked by: Build 2918
97Blocked by: Build 2918
98Blocked by: Build 2918
99Blocked by: Build 2918
100Blocked by: Build 2918
101Blocked by: Build 2918
102Blocked by: Build 2918
103Blocked by: Build 2918
104Blocked by: Build 2918
105Blocked by: Build 2918
106Blocked by: Build 2918
107Blocked by: Build 2918
108Blocked by: Build 2918
109Blocked by: Build 2918
110Blocked by: Build 2918
111Blocked by: Build 2918
112Blocked by: Build 2918
113Blocked by: Build 2918
114Blocked by: Build 2918
115Blocked by: Build 2918
116Blocked by: Build 2918
117Blocked by: Build 2918
118Blocked by: Build 2918
119Blocked by: Build 2918
120Blocked by: Build 2918
121Blocked by: Build 2918
122Blocked by: Build 2918
123Blocked by: Build 2918
124Blocked by: Build 2918
125Blocked by: Build 2918
126Blocked by: Build 2918
127Blocked by: Build 2918
128Blocked by: Build 2918
129Blocked by: Build 2918
130Blocked by: Build 2918
131Blocked by: Build 2918
132Blocked by: Build 2918
133Blocked by: Build 2918
134Blocked by: Build 2918
135Blocked by: Build 2918
136Blocked by: Build 2918
137Blocked by: Build 2918
138Blocked by: Build 2918
139Blocked by: Build 2918
140Blocked by: Build 2918
141Blocked by: Build 2918
142Blocked by: Build 2918
143Blocked by: Build 2918
144Blocked by: Build 2918
145Blocked by: Build 2918
146Blocked by: Build 2918
147Blocked by: Build 2918
148Blocked by: Build 2918
149Blocked by: Build 2918
150Blocked by: Build 2918
151Blocked by: Build 2918
152Blocked by: Build 2918
153Blocked by: Build 2918
154Blocked by: Build 2918
155Blocked by: Build 2918
156Blocked by: Build 2918
157Blocked by: Build 2918
158Blocked by: Build 2918
159Blocked by: Build 2918
160Blocked by: Build 2918
161Blocked by: Build 2918
162Blocked by: Build 2918
163Blocked by: Build 2918
164Blocked by: Build 2918
165Blocked by: Build 2918
166Blocked by: Build 2918
167Blocked by: Build 2918
168Blocked by: Build 2918
169Blocked by: Build 2918
170Blocked by: Build 2918
171Blocked by: Build 2918
172Blocked by: Build 2918
173Blocked by: Build 2918
174Blocked by: Build 2918
175Blocked by: Build 2918
176Blocked by: Build 2918
177Blocked by: Build 2918
178Blocked by: Build 2918
179Blocked by: Build 2918
180Blocked by: Build 2918
181Blocked by: Build 2918
182Blocked by: Build 2918
183Blocked by: Build 2918
184Blocked by: Build 2918
185Blocked by: Build 2918
186Blocked by: Build 2918
187Blocked by: Build 2918
188Blocked by: Build 2918
189Blocked by: Build 2918
190Blocked by: Build 2918
191Blocked by: Build 2918
192Blocked by: Build 2918
193Blocked by: Build 2918
194Blocked by: Build 2918
195Blocked by: Build 2918
196Blocked by: Build 2918
197Blocked by: Build 2918
198Blocked by: Build 2918
199Blocked by: Build 2918
200Blocked by: Build 2918
201Blocked by: Build 2918
202Blocked by: Build 2918
203Blocked by: Build 2918
204Blocked by: Build 2918
205Blocked by: Build 2918
206Blocked by: Build 2918
207Blocked by: Build 2918
208Blocked by: Build 2918
209Blocked by: Build 2918
210Blocked by: Build 2918
211Blocked by: Build 2918
212Blocked by: Build 2918
213Blocked by: Build 2918
214Blocked by: Build 2918
215Blocked by: Build 2918
216Blocked by: Build 2918
217Blocked by: Build 2918
218Blocked by: Build 2918
219Blocked by: Build 2918
220Blocked by: Build 2918
221Blocked by: Build 2918
222Blocked by: Build 2918
223Blocked by: Build 2918
224Blocked by: Build 2918
225Blocked by: Build 2918
226Blocked by: Build 2918
227Blocked by: Build 2918
228Blocked by: Build 2918
229Blocked by: Build 2918
230Blocked by: Build 2918
231Blocked by: Build 2918
232Blocked by: Build 2918
233Blocked by: Build 2918
234Blocked by: Build 2918
235Blocked by: Build 2918
236Blocked by: Build 2918
237Blocked by: Build 2918
238Blocked by: Build 2918
239Blocked by: Build 2918
240Blocked by: Build 2918
241Blocked by: Build 2918
242Blocked by: Build 2918
243Blocked by: Build 2918
244Blocked by: Build 2918
245Blocked by: Build 2918
246Blocked by: Build 2918
247Blocked by: Build 2918
248Blocked by: Build 2918
249Blocked by: Build 2918
250Blocked by: Build 2918
251Blocked by: Build 2918
252Blocked by: Build 2918
253Blocked by: Build 2918
254Blocked by: Build 2918
255Blocked by: Build 2918
256Blocked by: Build 2918
257Blocked by: Build 2918
258Blocked by: Build 2918
259Blocked by: Build 2918
260Blocked by: Build 2918
261Blocked by: Build 2918
262Blocked by: Build 2918
263Blocked by: Build 2918
264Blocked by: Build 2918
265Blocked by: Build 2918
266Blocked by: Build 2918
267Blocked by: Build 2918
268Blocked by: Build 2918
269Blocked by: Build 2918
270Blocked by: Build 2918
271Blocked by: Build 2918
272Blocked by: Build 2918
273Blocked by: Build 2918
274Blocked by: Build 2918
275Blocked by: Build 2918
276Blocked by: Build 2918
277Blocked by: Build 2918
278Blocked by: Build 2918
279Blocked by: Build 2918
280Blocked by: Build 2918
281Blocked by: Build 2918
282Blocked by: Build 2918
283Blocked by: Build 2918
284Blocked by: Build 2918
285Blocked by: Build 2918
286Blocked by: Build 2918
287Blocked by: Build 2918
288Blocked by: Build 2918
289Blocked by: Build 2918
290Blocked by: Build 2918
291Blocked by: Build 2918
292Blocked by: Build 2918
293Blocked by: Build 2918
294Blocked by: Build 2918
295Blocked by: Build 2918
296Blocked by: Build 2918
297Blocked by: Build 2918
298Blocked by: Build 2918
299Blocked by: Build 2918
300Blocked by: Build 2918
301Blocked by: Build 2918
302Blocked by: Build 2918
303Blocked by: Build 2918
304Blocked by: Build 2918
305Blocked by: Build 2918
306Blocked by: Build 2918
307Blocked by: Build 2918
308Blocked by: Build 2918
309Blocked by: Build 2918
310Blocked by: Build 2918
311Blocked by: Build 2918
312Blocked by: Build 2918
313Blocked by: Build 2918
314Blocked by: Build 2918
315Blocked by: Build 2918
316Blocked by: Build 2918
317Blocked by: Build 2918
318Blocked by: Build 2918
319Blocked by: Build 2918
320Blocked by: Build 2918
321Blocked by: Build 2918
322Blocked by: Build 2918
323Blocked by: Build 2918
324Blocked by: Build 2918
325Blocked by: Build 2918
326Blocked by: Build 2918
327Blocked by: Build 2918
328Blocked by: Build 2918
329Blocked by: Build 2918
330Blocked by: Build 2918
331Blocked by: Build 2918
332Blocked by: Build 2918
333Blocked by: Build 2918
334Blocked by: Build 2918
335Blocked by: Build 2918
336Blocked by: Build 2918
337Blocked by: Build 2918
338Blocked by: Build 2918
339Blocked by: Build 2918
340Blocked by: Build 2918
341Blocked by: Build 2918
342Blocked by: Build 2918
343Blocked by: Build 2918
344Blocked by: Build 2918
345Blocked by: Build 2918
346Blocked by: Build 2918
347Blocked by: Build 2918
348Blocked by: Build 2918
349Blocked by: Build 2918
350Blocked by: Build 2918
351Blocked by: Build 2918
352Blocked by: Build 2918
353Blocked by: Build 2918
354Blocked by: Build 2918
355Blocked by: Build 2918
356Blocked by: Build 2918
357Blocked by: Build 2918
358Blocked by: Build 2918
359Blocked by: Build 2918
360Blocked by: Build 2918
361Blocked by: Build 2918
362Blocked by: Build 2918
363Blocked by: Build 2918
364Blocked by: Build 2918
365Blocked by: Build 2918
366Blocked by: Build 2918
367Blocked by: Build 2918
368Blocked by: Build 2918
369Blocked by: Build 2918
370Blocked by: Build 2918
371Blocked by: Build 2918
372Blocked by: Build 2918
373Blocked by: Build 2918
374Blocked by: Build 2918
375Blocked by: Build 2918
376Blocked by: Build 2918
377Blocked by: Build 2918
378Blocked by: Build 2918
379Blocked by: Build 2918
380Blocked by: Build 2918
381Blocked by: Build 2918
382Blocked by: Build 2918
383Blocked by: Build 2918
384Blocked by: Build 2918
385Blocked by: Build 2918
386Blocked by: Build 2918
387Blocked by: Build 2918
388Blocked by: Build 2918
389Blocked by: Build 2918
390Blocked by: Build 2918
391Blocked by: Build 2918
392Blocked by: Build 2918
393Blocked by: Build 2918
394Blocked by: Build 2918
395Blocked by: Build 2918
396Blocked by: Build 2918
397Blocked by: Build 2918
398Blocked by: Build 2918
399Blocked by: Build 2918
400Blocked by: Build 2918
401Blocked by: Build 2918
402Blocked by: Build 2918
403Blocked by: Build 2918
404Blocked by: Build 2918
405Blocked by: Build 2918
406Blocked by: Build 2918
407Blocked by: Build 2918
408Blocked by: Build 2918
409Blocked by: Build 2918
410Blocked by: Build 2918
411Blocked by: Build 2918
412Blocked by: Build 2918
413Blocked by: Build 2918
414Blocked by: Build 2918
415Blocked by: Build 2918
416Blocked by: Build 2918
417Blocked by: Build 2918
418Blocked by: Build 2918
419Blocked by: Build 2918
420Blocked by: Build 2918
421Blocked by: Build 2918
422Blocked by: Build 2918
423Blocked by: Build 2918
424Blocked by: Build 2918
425Blocked by: Build 2918
426Blocked by: Build 2918
427Blocked by: Build 2918
428Blocked by: Build 2918
429Blocked by: Build 2918
430Blocked by: Build 2918
431Blocked by: Build 2918
432Blocked by: Build 2918
433Blocked by: Build 2918
434Blocked by: Build 2918
435Blocked by: Build 2918
436Blocked by: Build 2918
437Blocked by: Build 2918
438Blocked by: Build 2918
439Blocked by: Build 2918
440Blocked by: Build 2918
441Blocked by: Build 2918
442Blocked by: Build 2918
443Blocked by: Build 2918
444Blocked by: Build 2918
445Blocked by: Build 2918
446Blocked by: Build 2918
447Blocked by: Build 2918
448Blocked by: Build 2918
449Blocked by: Build 2918
450Blocked by: Build 2918
451Blocked by: Build 2918
452Blocked by: Build 2918
453Blocked by: Build 2918
454Blocked by: Build 2918
455Blocked by: Build 2918
456Blocked by: Build 2918
457Blocked by: Build 2918
458Blocked by: Build 2918
459Blocked by: Build 2918
460Blocked by: Build 2918
461Blocked by: Build 2918
462Blocked by: Build 2918
463Blocked by: Build 2918
464Blocked by: Build 2918
465Blocked by: Build 2918
466Blocked by: Build 2918
467Blocked by: Build 2918
468Blocked by: Build 2918
469Blocked by: Build 2918
470Blocked by: Build 2918
471Blocked by: Build 2918
472Blocked by: Build 2918
473Blocked by: Build 2918
474Blocked by: Build 2918
475Blocked by: Build 2918
476Blocked by: Build 2918
477Blocked by: Build 2918
478Blocked by: Build 2918
479Blocked by: Build 2918
480Blocked by: Build 2918
481Blocked by: Build 2918
482Blocked by: Build 2918
483Blocked by: Build 2918
484Blocked by: Build 2918
485Blocked by: Build 2918
486Blocked by: Build 2918
487Blocked by: Build 2918
488Blocked by: Build 2918
489Blocked by: Build 2918
490Blocked by: Build 2918
491Blocked by: Build 2918
492Blocked by: Build 2918
493Blocked by: Build 2918
494Blocked by: Build 2918
495Blocked by: Build 2918
496Blocked by: Build 2918
497Blocked by: Build 2918
498Blocked by: Build 2918
499Blocked by: Build 2918
500Blocked by: Build 2918
501Blocked by: Build 2918
502Blocked by: Build 2918
503Blocked by: Build 2918
504Blocked by: Build 2918
505Blocked by: Build 2918
506Blocked by: Build 2918
507Blocked by: Build 2918
508Blocked by: Build 2918
509Blocked by: Build 2918
510Blocked by: Build 2918
511Blocked by: Build 2918
512Blocked by: Build 2918
513Blocked by: Build 2918
514Blocked by: Build 2918
515Blocked by: Build 2918
516Blocked by: Build 2918
517Blocked by: Build 2918
518Blocked by: Build 2918
519Blocked by: Build 2918
520Blocked by: Build 2918
521Blocked by: Build 2918
522Blocked by: Build 2918
523Blocked by: Build 2918
524Blocked by: Build 2918
525Blocked by: Build 2918
526Blocked by: Build 2918
527Blocked by: Build 2918
528Blocked by: Build 2918
529Blocked by: Build 2918
530Blocked by: Build 2918
531Blocked by: Build 2918
532Blocked by: Build 2918
533Blocked by: Build 2918
534Blocked by: Build 2918
535Blocked by: Build 2918
536Blocked by: Build 2918
537Blocked by: Build 2918
538Blocked by: Build 2918
539Blocked by: Build 2918
540Blocked by: Build 2918
541Blocked by: Build 2918
542Blocked by: Build 2918
543Blocked by: Build 2918
544Blocked by: Build 2918
545Blocked by: Build 2918
546Blocked by: Build 2918
547Blocked by: Build 2918
548Blocked by: Build 2918
549Blocked by: Build 2918
550Blocked by: Build 2918
551Blocked by: Build 2918
552Blocked by: Build 2918
553Blocked by: Build 2918
554Blocked by: Build 2918
555Blocked by: Build 2918
556Blocked by: Build 2918
557Blocked by: Build 2918
558Blocked by: Build 2918
559Blocked by: Build 2918
560Blocked by: Build 2918
561Blocked by: Build 2918
562Blocked by: Build 2918
563Blocked by: Build 2918
564Blocked by: Build 2918
565Blocked by: Build 2918
566Blocked by: Build 2918
567Blocked by: Build 2918
568Blocked by: Build 2918
569Blocked by: Build 2918
570Blocked by: Build 2918
571Blocked by: Build 2918
572Blocked by: Build 2918
573Blocked by: Build 2918
574Blocked by: Build 2918
575Blocked by: Build 2918
576Blocked by: Build 2918
577Blocked by: Build 2918
578Blocked by: Build 2918
579Blocked by: Build 2918
580Blocked by: Build 2918
581Blocked by: Build 2918
582Blocked by: Build 2918
583Blocked by: Build 2918
584Blocked by: Build 2918
585Blocked by: Build 2918
586Blocked by: Build 2918
587Blocked by: Build 2918
588Blocked by: Build 2918
589Blocked by: Build 2918
590Blocked by: Build 2918
591Blocked by: Build 2918
592Blocked by: Build 2918
593Blocked by: Build 2918
594Blocked by: Build 2918
595Blocked by: Build 2918
596Blocked by: Build 2918
597Blocked by: Build 2918
598Blocked by: Build 2918
599Blocked by: Build 2918
600Blocked by: Build 2918
601Blocked by: Build 2918
602Blocked by: Build 2918
603Blocked by: Build 2918
604Blocked by: Build 2918
605Blocked by: Build 2918
606Blocked by: Build 2918
607Blocked by: Build 2918
608Blocked by: Build 2918
609Blocked by: Build 2918
610Blocked by: Build 2918
611Blocked by: Build 2918
612Blocked by: Build 2918
613Blocked by: Build 2918
614Blocked by: Build 2918
615Blocked by: Build 2918
616Blocked by: Build 2918
617Blocked by: Build 2918
618Blocked by: Build 2918
619Blocked by: Build 2918
620Blocked by: Build 2918
621Blocked by: Build 2918
622Blocked by: Build 2918
623Blocked by: Build 2918
624Blocked by: Build 2918
625Blocked by: Build 2918
626Blocked by: Build 2918
627Blocked by: Build 2918
628Blocked by: Build 2918
629Blocked by: Build 2918
630Blocked by: Build 2918
631Blocked by: Build 2918
632Blocked by: Build 2918
633Blocked by: Build 2918
634Blocked by: Build 2918
635Blocked by: Build 2918
636Blocked by: Build 2918
637Blocked by: Build 2918
638Blocked by: Build 2918
639Blocked by: Build 2918
640Blocked by: Build 2918
641Blocked by: Build 2918
642Blocked by: Build 2918
643Blocked by: Build 2918
644Blocked by: Build 2918
645Blocked by: Build 2918
646Blocked by: Build 2918
647Blocked by: Build 2918
648Blocked by: Build 2918
649Blocked by: Build 2918
650Blocked by: Build 2918
651Blocked by: Build 2918
652Blocked by: Build 2918
653Blocked by: Build 2918
654Blocked by: Build 2918
655Blocked by: Build 2918
656Blocked by: Build 2918
657Blocked by: Build 2918
658Blocked by: Build 2918
659Blocked by: Build 2918
660Blocked by: Build 2918
661Blocked by: Build 2918
662Blocked by: Build 2918
663Blocked by: Build 2918
664Blocked by: Build 2918
665Blocked by: Build 2918
666Blocked by: Build 2918
667Blocked by: Build 2918
668Blocked by: Build 2918
669Blocked by: Build 2918
670Blocked by: Build 2918
671Blocked by: Build 2918
672Blocked by: Build 2918
673Blocked by: Build 2918
674Blocked by: Build 2918
675Blocked by: Build 2918
676Blocked by: Build 2918
677Blocked by: Build 2918
678Blocked by: Build 2918
679Blocked by: Build 2918
680Blocked by: Build 2918
681Blocked by: Build 2918
682Blocked by: Build 2918
683Blocked by: Build 2918
684Blocked by: Build 2918
685Blocked by: Build 2918
686Blocked by: Build 2918
687Blocked by: Build 2918
688Blocked by: Build 2918
689Blocked by: Build 2918
690Blocked by: Build 2918
691Blocked by: Build 2918
692Blocked by: Build 2918
693Blocked by: Build 2918
694Blocked by: Build 2918
695Blocked by: Build 2918
696Blocked by: Build 2918
697Blocked by: Build 2918
698Blocked by: Build 2918
699Blocked by: Build 2918
700Blocked by: Build 2918
701Blocked by: Build 2918
702Blocked by: Build 2918
703Blocked by: Build 2918
704Blocked by: Build 2918
705Blocked by: Build 2918
706Blocked by: Build 2918
707Blocked by: Build 2918
708Blocked by: Build 2918
709Blocked by: Build 2918
710Blocked by: Build 2918
711Blocked by: Build 2918
712Blocked by: Build 2918
713Blocked by: Build 2918
714Blocked by: Build 2918
715Blocked by: Build 2918
716Blocked by: Build 2918
717Blocked by: Build 2918
718Blocked by: Build 2918
719Blocked by: Build 2918
720Blocked by: Build 2918
721Blocked by: Build 2918
722Blocked by: Build 2918
723Blocked by: Build 2918
724Blocked by: Build 2918
725Blocked by: Build 2918
726Blocked by: Build 2918
727Blocked by: Build 2918
728Blocked by: Build 2918
729Blocked by: Build 2918
730Blocked by: Build 2918
731Blocked by: Build 2918
732Blocked by: Build 2918
733Blocked by: Build 2918
734Blocked by: Build 2918
735Blocked by: Build 2918
736Blocked by: Build 2918
737Blocked by: Build 2918
738Blocked by: Build 2918
739Blocked by: Build 2918
740Blocked by: Build 2918
741Blocked by: Build 2918
742Blocked by: Build 2918
743Blocked by: Build 2918
744Blocked by: Build 2918
745Blocked by: Build 2918
746Blocked by: Build 2918
747Blocked by: Build 2918
748Blocked by: Build 2918
749Blocked by: Build 2918
750Blocked by: Build 2918
751Blocked by: Build 2918
752Blocked by: Build 2918
753Blocked by: Build 2918
754Blocked by: Build 2918
755Blocked by: Build 2918
756Blocked by: Build 2918
757Blocked by: Build 2918
758Blocked by: Build 2918
759Blocked by: Build 2918
760Blocked by: Build 2918
761Blocked by: Build 2918
762Blocked by: Build 2918
763Blocked by: Build 2918
764Blocked by: Build 2918
765Blocked by: Build 2918
766Blocked by: Build 2918
767Blocked by: Build 2918
768Blocked by: Build 2918
769Blocked by: Build 2918
770Blocked by: Build 2918
771Blocked by: Build 2918
772Blocked by: Build 2918
773Blocked by: Build 2918
774Blocked by: Build 2918
775Blocked by: Build 2918
776Blocked by: Build 2918
777Blocked by: Build 2918
778Blocked by: Build 2918
779Blocked by: Build 2918
780Blocked by: Build 2918
781Blocked by: Build 2918
782Blocked by: Build 2918
783Blocked by: Build 2918
784Blocked by: Build 2918
785Blocked by: Build 2918
786Blocked by: Build 2918
787Blocked by: Build 2918
788Blocked by: Build 2918
789Blocked by: Build 2918
790Blocked by: Build 2918
791Blocked by: Build 2918
792Blocked by: Build 2918
793Blocked by: Build 2918
794Blocked by: Build 2918
795Blocked by: Build 2918
796Blocked by: Build 2918
797Blocked by: Build 2918
798Blocked by: Build 2918
799Blocked by: Build 2918
800Blocked by: Build 2918
801Blocked by: Build 2918
802Blocked by: Build 2918
803Blocked by: Build 2918
804Blocked by: Build 2918
805Blocked by: Build 2918
806Blocked by: Build 2918
807Blocked by: Build 2918
808Blocked by: Build 2918
809Blocked by: Build 2918
810Blocked by: Build 2918
811Blocked by: Build 2918
812Blocked by: Build 2918
813Blocked by: Build 2918
814Blocked by: Build 2918
815Blocked by: Build 2918
816Blocked by: Build 2918
817Blocked by: Build 2918
818Blocked by: Build 2918
819Blocked by: Build 2918
820Blocked by: Build 2918
821Blocked by: Build 2918
822Blocked by: Build 2918
823Blocked by: Build 2918
824Blocked by: Build 2918
825Blocked by: Build 2918
826Blocked by: Build 2918
827Blocked by: Build 2918
828Blocked by: Build 2918
829Blocked by: Build 2918
830Blocked by: Build 2918
831Blocked by: Build 2918
832Blocked by: Build 2918
833Blocked by: Build 2918
834Blocked by: Build 2918
835Blocked by: Build 2918
836Blocked by: Build 2918
837Blocked by: Build 2918
838Blocked by: Build 2918
839Blocked by: Build 2918
840Blocked by: Build 2918
841Blocked by: Build 2918
842Blocked by: Build 2918
843Blocked by: Build 2918
844Blocked by: Build 2918
845Blocked by: Build 2918
846Blocked by: Build 2918
847Blocked by: Build 2918
848Blocked by: Build 2918
849Blocked by: Build 2918
850Blocked by: Build 2918
851

Event Timeline