Page MenuHomePhorge

Build 2670
FailedPublic

Drydock: Run Command

When
Completed at Feb 12 2016, 11:53 AM · Built for 7 m, 11 s
Status
Failed

Build Log 8798 (remote - stderr)
25 - 50 - 100 - Unlimited Lines

35+ git fetch origin
36+ git reset --hard origin/master
37+ git clean -d -f -x
38+ popd
39+ export commit
40+ export differential
41+ export id
42+ export package
43+ export phid
44+ export ro_uri
45+ export uri
46+ export vcs
47+ export test_build
48+ export test_functional
49+ export test_integration
50+ export test_performance
51+ export test_unit
52+ export test_obs
53+ '[' '!' -d /var/tmp/osbuild-packagecache ']'
54+ '[' -x stick.git/drydocker/roundcubemail-plugins-kolab/build.sh ']'
55+ pushd roundcubemail-plugins-kolab.git
56+ ../stick.git/drydocker/roundcubemail-plugins-kolab/build.sh
57+ docker run -i --attach=stdout --attach=stderr --detach=false --rm=true --volume=/root/.oscrc:/root/.oscrc --volume=/var/tmp/osbuild-packagecache/:/var/tmp/osbuild-packagecache/ --hostname=kolab.example.org -e ID=2670 -e COMMIT=a7af7a9b81cc1e548773f277bda0d219b3de65fe -e DIFFERENTIAL= -e PACKAGE=roundcubemail-plugins-kolab -e PHAB_CERT= -e PHAB_USER= -e PHID=PHID-HMBT-7duk3o3eppzfelwbese5 -e URI=ssh://git@git.kolab.org/diffusion/RPK/roundcubemail-plugins-kolab.git -e RO_URI=https://git.kolab.org/diffusion/RPK/roundcubemail-plugins-kolab.git -e VCS=git -e TEST_BUILD=1 -e TEST_FUNCTIONAL=1 -e TEST_INTEGRATION=1 -e TEST_PERFORMANCE=1 -e TEST_UNIT=1 -e TEST_OBS=1 kolab/ci-maipo
58Switched to a new branch 'dev/sabre-vobject3'
59Switched to a new branch 'manticore'
60Switched to branch 'master'
61Switched to a new branch 'roundcubemail-plugins-kolab-0.6'
62Switched to a new branch 'roundcubemail-plugins-kolab-0.7'
63Switched to a new branch 'roundcubemail-plugins-kolab-0.8'
64Switched to a new branch 'roundcubemail-plugins-kolab-0.9'
65Switched to a new branch 'roundcubemail-plugins-kolab-3.0'
66Switched to a new branch 'roundcubemail-plugins-kolab-3.1'
67Switched to a new branch 'roundcubemail-plugins-kolab-3.2'
68Note: checking out 'a7af7a9b81cc1e548773f277bda0d219b3de65fe'.
69
70You are in 'detached HEAD' state. You can look around, make experimental
71changes and commit them, and you can discard any commits you make in this
72state without impacting any branches by performing another checkout.
73
74If you want to create a new branch to retain commits you create, you may
75do so (now or later) by using -b with the checkout command again. Example:
76
77 git checkout -b new_branch_name
78
79HEAD is now at a7af7a9... Fix JS error when using tasks filter after task delete (T1005)
80+ exit 1
81+ retval=1
82+ popd
83+ exit 1
84

Build Log 8797 (remote - stdout)
25 - 50 - 100 - Unlimited Lines

1701++++ tail -n 1
1702++++ sort --version-sort -u
1703+++ tag_version=
1704+++ '[' -z '' -a -z 3.3 ']'
1705++++ echo -e '3.3\n0\n'
1706++++ sort --version-sort -u
1707++++ tail -n 1
1708+++ new_version=3.3
1709+++ '[' 3.3 == 0 ']'
1710+++ echo 'Going with new version: '\''3.3'\'''
1711Going with new version: '3.3'
1712+++ set - -x
1713/srv /srv/roundcubemail-plugins-kolab.git /srv/roundcubemail-plugins-kolab.git
1714Server returned an error: HTTP Error 500: Internal Server Error
1715
1716Request: https://obs.kolabsys.com/source/Kolab:Winterfell/roundcubemail-plugins-kolab?linkrev=base&rev=latest
1717Headers:
1718status: 500 Internal Server Error
1719x-request-id: 2c8972aa-67ed-4c1d-8a5c-dc8893b2cdda
1720x-powered-by: Phusion Passenger 4.0.40
1721connection: close
1722content-length: 116
1723server: Apache/2.4.6 (Linux/SUSE)
1724x-runtime: 0.021949
1725cache-control: public
1726date: Fri, 12 Feb 2016 10:53:23 GMT
1727content-type: application/xml; charset=utf-8
1728/srv/stick.git/drydocker/generic_obs.sh: line 24: pushd: Kolab:Winterfell/roundcubemail-plugins-kolab: No such file or directory
1729/srv/roundcubemail-plugins-kolab.git /srv /srv/roundcubemail-plugins-kolab.git /srv/roundcubemail-plugins-kolab.git
1730Going with new version: '3.3'
1731About to create /srv/Kolab:Winterfell/roundcubemail-plugins-kolab/roundcubemail-plugins-kolab-3.3.tar.gz
1732/srv/stick.git/drydocker/generic_obs.sh: line 48: /srv/Kolab:Winterfell/roundcubemail-plugins-kolab/roundcubemail-plugins-kolab-3.3.tar.gz: No such file or directory
1733Creating /srv/Kolab:Winterfell/roundcubemail-plugins-kolab/roundcubemail-plugins-kolab-3.3.tar.gz completed
1734ls: cannot access /srv/Kolab:Winterfell/roundcubemail-plugins-kolab/: No such file or directory
1735/srv /srv/roundcubemail-plugins-kolab.git /srv/roundcubemail-plugins-kolab.git
1736Error: '/srv' is not an osc project dir or working copy
1737/srv/roundcubemail-plugins-kolab.git /srv/roundcubemail-plugins-kolab.git
1738/srv/roundcubemail-plugins-kolab.git
1739Running obs_build_local FAILED (at a7af7a9b81cc1e548773f277bda0d219b3de65fe)
1740Running ../stick.git/drydocker/roundcubemail-plugins-kolab/test_obs.sh FAILED (at a7af7a9b81cc1e548773f277bda0d219b3de65fe)
1741========================================================================
1742 Running 'generic_php_lint' OK (at a7af7a9b81cc1e548773f277bda0d219b3de65fe)
1743 Running 'generic_js_lint' FAILED (at 81ffe68df559295412744cdc7a8ca28a42c1bf54)
1744 Running 'generic_js_lint' OK (at a7af7a9b81cc1e548773f277bda0d219b3de65fe)
1745 Running '../stick.git/drydocker/roundcubemail-plugins-kolab/test_build.sh' OK (at a7af7a9b81cc1e548773f277bda0d219b3de65fe)
1746 Running 'obs_build_local' FAILED (at a7af7a9b81cc1e548773f277bda0d219b3de65fe)
1747 Running '../stick.git/drydocker/roundcubemail-plugins-kolab/test_obs.sh' FAILED (at a7af7a9b81cc1e548773f277bda0d219b3de65fe)
1748========================================================================
1749/var/drydock/workingcopy-215831/repo/roundcubemail-plugins-kolab
1750

Lease Working Copy

When
Completed at Feb 12 2016, 11:46 AM · Built instantly
Status
Passed

Wait for Previous Commits to Build

When
Completed at Feb 12 2016, 11:46 AM · Built instantly
Status
Passed

Build Log 8796 (waiting - blockers)
25 - 50 - 100 - Unlimited Lines

1Blocked by: Build 2669
2Blocked by: Build 2669
3Blocked by: Build 2669
4Blocked by: Build 2669
5

Event Timeline