Page MenuHomePhorge

Build 1050
FailedPublic

Run Command

This build step has since been deleted on the build plan. Some information may be omitted.
When
Completed at Jul 20 2015, 11:46 AM · Built for 1 m, 37 s
Status
Failed

Build Log 3925 (remote - stderr)
25 - 50 - 100 - Unlimited Lines

16+ case ${package} in
17++ pwd
18+ export TMPDIR=/var/tmp/1447
19+ TMPDIR=/var/tmp/1447
20+ '[' '!' -d copenhagen.git ']'
21+ git clone https://git.kolab.org/diffusion/CO/copenhagen.git copenhagen.git
22+ pushd copenhagen.git
23+ git checkout 1b54149998bb5606d623cf5fa4cef827033f27c9
24Note: checking out '1b54149998bb5606d623cf5fa4cef827033f27c9'.
25
26You are in 'detached HEAD' state. You can look around, make experimental
27changes and commit them, and you can discard any commits you make in this
28state without impacting any branches by performing another checkout.
29
30If you want to create a new branch to retain commits you create, you may
31do so (now or later) by using -b with the checkout command again. Example:
32
33 git checkout -b new_branch_name
34
35HEAD is now at 1b54149... Cleanup some code
36+ popd
37+ '[' copenhagen '!=' stick ']'
38+ '[' '!' -d stick.git ']'
39+ git clone https://git.kolab.org/diffusion/QA/stick.git stick.git
40+ export commit
41+ export differential
42+ export id
43+ export package
44+ export phid
45+ export ro_uri
46+ export uri
47+ export vcs
48+ export test_build
49+ export test_functional
50+ export test_integration
51+ export test_performance
52+ export test_unit
53+ export test_obs
54+ '[' '!' -d /var/tmp/osbuild-packagecache ']'
55+ '[' -x stick.git/drydocker/copenhagen/build.sh ']'
56+ pushd copenhagen.git
57+ ../stick.git/drydocker/copenhagen/build.sh
58+ docker run -it --attach=stdout --attach=stderr --detach=false --rm=true --volume=/root/.oscrc:/root/.oscrc --volume=/var/tmp/osbuild-packagecache/:/var/tmp/osbuild-packagecache/ --hostname=kolab.example.org -e ID=1050 -e COMMIT=1b54149998bb5606d623cf5fa4cef827033f27c9 -e DIFFERENTIAL= -e PACKAGE=copenhagen -e PHAB_CERT= -e PHAB_USER= -e PHID=PHID-HMBT-ekjdy2somtrk7bfu3dxj -e URI=ssh://git@git.kolab.org/diffusion/CO/copenhagen.git -e RO_URI=https://git.kolab.org/diffusion/CO/copenhagen.git -e VCS=git -e TEST_BUILD=1 -e TEST_FUNCTIONAL=1 -e TEST_INTEGRATION=1 -e TEST_PERFORMANCE=1 -e TEST_UNIT=1 -e TEST_OBS=1 kolab/ci-maipo
59+ exit 1
60+ retval=1
61+ popd
62+ cd /var/tmp
63+ rm -rf /var/tmp/1447
64+ exit 1
65

Build Log 3924 (remote - stdout)
25 - 50 - 100 - Unlimited Lines

3739+++ echo 'The latest stable branch is '\'''\'''
3740The latest stable branch is ''
3741+++ '[' master == master ']'
3742+++ '[' '!' -z '' ']'
3743+++ master_version=
3744+++ stable_version=0
3745++++ git tag -l
3746++++ grep -E '(\.[0-9]+)+$'
3747++++ sed -r -e 's/^.*([0-9]\.([0-9]+(\.[0-9]+)+))$/\1/g'
3748++++ sort --version-sort -u
3749++++ tail -n 1
3750++++ awk -F. '{$NF+=1; OFS="."; print $0}'
3751+++ tag_version=0.0.2
3752+++ '[' -z 0.0.2 -a -z '' ']'
3753++++ echo -e '\n0\n0.0.2'
3754++++ sort --version-sort -u
3755++++ tail -n 1
3756+++ new_version=0.0.2
3757+++ '[' 0.0.2 == 0 ']'
3758+++ echo 'Going with new version: '\''0.0.2'\'''
3759Going with new version: '0.0.2'
3760+++ set - -x
3761/srv /srv/copenhagen.git /srv/copenhagen.git
3762Server returned an error: HTTP Error 404: Not Found
3763Error getting meta for project 'Kolab:3.4:Updates' package 'copenhagen'
3764Kolab:3.4:Updates/copenhagen
3765/srv/stick.git/drydocker/generic_obs.sh: line 24: pushd: Kolab:3.4:Updates/copenhagen: No such file or directory
3766/srv/copenhagen.git /srv /srv/copenhagen.git /srv/copenhagen.git
3767Going with new version: '0.0.2'
3768/srv/stick.git/drydocker/generic_obs.sh: line 45: /srv/Kolab:3.4:Updates/copenhagen/copenhagen-0.0.2.tar.gz: No such file or directory
3769/srv /srv/copenhagen.git /srv/copenhagen.git
3770sed: can't read copenhagen.spec: No such file or directory
3771sed: can't read copenhagen.dsc: No such file or directory
3772sed: can't read debian.changelog: No such file or directory
3773Error: '/srv' is not an osc project dir or working copy
3774/srv/copenhagen.git /srv/copenhagen.git
3775/srv/copenhagen.git
3776Running obs_build_local FAILED (at 1b54149998bb5606d623cf5fa4cef827033f27c9)
3777Running ../stick.git/drydocker/copenhagen/test_obs.sh FAILED (at 1b54149998bb5606d623cf5fa4cef827033f27c9)
3778========================================================================
3779 Running '_install_package_builddep copenhagen' OK (at 1b54149998bb5606d623cf5fa4cef827033f27c9)
3780 Running 'generic_php_lint' OK (at 1b54149998bb5606d623cf5fa4cef827033f27c9)
3781 Running 'generic_js_lint' OK (at 1b54149998bb5606d623cf5fa4cef827033f27c9)
3782 Running '../stick.git/drydocker/copenhagen/test_build.sh' OK (at 1b54149998bb5606d623cf5fa4cef827033f27c9)
3783 Running '../stick.git/drydocker/copenhagen/test_unit.sh' OK (at 1b54149998bb5606d623cf5fa4cef827033f27c9)
3784 Running 'obs_build_local' FAILED (at 1b54149998bb5606d623cf5fa4cef827033f27c9)
3785 Running '../stick.git/drydocker/copenhagen/test_obs.sh' FAILED (at 1b54149998bb5606d623cf5fa4cef827033f27c9)
3786========================================================================
3787/var/tmp/1447
3788

Lease Host

This build step has since been deleted on the build plan. Some information may be omitted.
When
Completed at Jul 20 2015, 11:45 AM · Built for 1 s
Status
Passed

Wait for Previous Commits to Build

When
Completed at Jul 20 2015, 11:45 AM · Built instantly
Status
Passed
1 empty logs are hidden. Show all logs.

Event Timeline