Page MenuHomekolab.org

phpunit output
ActivePublic

Authored by vanmeeuwen on Feb 10 2020, 10:01 AM.
[vanmeeuwen@dws06 src (dev/without-quota-table *+%)]$ vendor/bin/phpunit tests/
PHPUnit 7.5.20 by Sebastian Bergmann and contributors.
FFSEFEFFSEESSEFESSFE.IIII..............EEEEEEEEEEE............. 63 / 108 ( 58%)
.IIIF..FE.EEE.E...E.......................... 108 / 108 (100%)
Time: 11.36 minutes, Memory: 68.50 MB
There were 24 errors:
1) Tests\Browser\ErrorTest::testError404Page
Facebook\WebDriver\Exception\TimeOutException: Waited 5 seconds for selector [#app > #error-page].
/home/vanmeeuwen/devel/src/apheleia/kolab.git/src/vendor/laravel/dusk/src/Concerns/WaitsForElements.php:291
/home/vanmeeuwen/devel/src/apheleia/kolab.git/src/vendor/laravel/dusk/src/Concerns/WaitsForElements.php:44
/home/vanmeeuwen/devel/src/apheleia/kolab.git/src/tests/Browser/ErrorTest.php:21
/home/vanmeeuwen/devel/src/apheleia/kolab.git/src/vendor/laravel/dusk/src/Concerns/ProvidesBrowser.php:68
/home/vanmeeuwen/devel/src/apheleia/kolab.git/src/tests/Browser/ErrorTest.php:25
2) Tests\Browser\LogonTest::testLogonRedirect
Facebook\WebDriver\Exception\TimeOutException: Waited 5 seconds for location [/login].
/home/vanmeeuwen/devel/src/apheleia/kolab.git/src/vendor/laravel/dusk/src/Concerns/WaitsForElements.php:291
/home/vanmeeuwen/devel/src/apheleia/kolab.git/src/vendor/laravel/dusk/src/Concerns/WaitsForElements.php:182
/home/vanmeeuwen/devel/src/apheleia/kolab.git/src/vendor/laravel/dusk/src/Concerns/WaitsForElements.php:144
/home/vanmeeuwen/devel/src/apheleia/kolab.git/src/tests/Browser/LogonTest.php:41
/home/vanmeeuwen/devel/src/apheleia/kolab.git/src/vendor/laravel/dusk/src/Concerns/ProvidesBrowser.php:68
/home/vanmeeuwen/devel/src/apheleia/kolab.git/src/tests/Browser/LogonTest.php:43
3) Tests\Browser\PasswordResetTest::testPasswordResetLinkOnLogon
ErrorException: stream_socket_client(): Filename cannot be empty
/home/vanmeeuwen/devel/src/apheleia/kolab.git/src/include/rcube_imap_generic.php:993
/home/vanmeeuwen/devel/src/apheleia/kolab.git/src/include/rcube_imap_generic.php:880
/home/vanmeeuwen/devel/src/apheleia/kolab.git/src/app/Backends/IMAP.php:51
/home/vanmeeuwen/devel/src/apheleia/kolab.git/src/app/Backends/IMAP.php:20
/home/vanmeeuwen/devel/src/apheleia/kolab.git/src/app/Jobs/ProcessUserVerify.php:48
/home/vanmeeuwen/devel/src/apheleia/kolab.git/src/vendor/laravel/framework/src/Illuminate/Container/BoundMethod.php:32
/home/vanmeeuwen/devel/src/apheleia/kolab.git/src/vendor/laravel/framework/src/Illuminate/Container/BoundMethod.php:90
/home/vanmeeuwen/devel/src/apheleia/kolab.git/src/vendor/laravel/framework/src/Illuminate/Container/BoundMethod.php:34
/home/vanmeeuwen/devel/src/apheleia/kolab.git/src/vendor/laravel/framework/src/Illuminate/Container/Container.php:576
/home/vanmeeuwen/devel/src/apheleia/kolab.git/src/vendor/laravel/framework/src/Illuminate/Bus/Dispatcher.php:94
/home/vanmeeuwen/devel/src/apheleia/kolab.git/src/vendor/laravel/framework/src/Illuminate/Pipeline/Pipeline.php:128
/home/vanmeeuwen/devel/src/apheleia/kolab.git/src/vendor/laravel/framework/src/Illuminate/Pipeline/Pipeline.php:104
/home/vanmeeuwen/devel/src/apheleia/kolab.git/src/vendor/laravel/framework/src/Illuminate/Bus/Dispatcher.php:98
/home/vanmeeuwen/devel/src/apheleia/kolab.git/src/vendor/laravel/framework/src/Illuminate/Queue/CallQueuedHandler.php:49
/home/vanmeeuwen/devel/src/apheleia/kolab.git/src/vendor/laravel/framework/src/Illuminate/Queue/Jobs/Job.php:88
/home/vanmeeuwen/devel/src/apheleia/kolab.git/src/vendor/laravel/framework/src/Illuminate/Queue/SyncQueue.php:42
/home/vanmeeuwen/devel/src/apheleia/kolab.git/src/vendor/laravel/framework/src/Illuminate/Bus/Dispatcher.php:184
/home/vanmeeuwen/devel/src/apheleia/kolab.git/src/vendor/laravel/framework/src/Illuminate/Bus/Dispatcher.php:160
/home/vanmeeuwen/devel/src/apheleia/kolab.git/src/vendor/laravel/framework/src/Illuminate/Bus/Dispatcher.php:73
/home/vanmeeuwen/devel/src/apheleia/kolab.git/src/vendor/laravel/framework/src/Illuminate/Foundation/Bus/PendingDispatch.php:112
/home/vanmeeuwen/devel/src/apheleia/kolab.git/src/vendor/laravel/framework/src/Illuminate/Foundation/helpers.php:399
/home/vanmeeuwen/devel/src/apheleia/kolab.git/src/vendor/laravel/framework/src/Illuminate/Bus/Queueable.php:147
/home/vanmeeuwen/devel/src/apheleia/kolab.git/src/vendor/laravel/framework/src/Illuminate/Queue/CallQueuedHandler.php:104
/home/vanmeeuwen/devel/src/apheleia/kolab.git/src/vendor/laravel/framework/src/Illuminate/Queue/CallQueuedHandler.php:53
/home/vanmeeuwen/devel/src/apheleia/kolab.git/src/vendor/laravel/framework/src/Illuminate/Queue/Jobs/Job.php:88
/home/vanmeeuwen/devel/src/apheleia/kolab.git/src/vendor/laravel/framework/src/Illuminate/Queue/SyncQueue.php:42
/home/vanmeeuwen/devel/src/apheleia/kolab.git/src/vendor/laravel/framework/src/Illuminate/Bus/Dispatcher.php:184
/home/vanmeeuwen/devel/src/apheleia/kolab.git/src/vendor/laravel/framework/src/Illuminate/Bus/Dispatcher.php:160
/home/vanmeeuwen/devel/src/apheleia/kolab.git/src/vendor/laravel/framework/src/Illuminate/Bus/Dispatcher.php:73
/home/vanmeeuwen/devel/src/apheleia/kolab.git/src/vendor/laravel/framework/src/Illuminate/Foundation/Bus/PendingDispatch.php:112
/home/vanmeeuwen/devel/src/apheleia/kolab.git/src/vendor/laravel/framework/src/Illuminate/Foundation/Bus/PendingChain.php:43
/home/vanmeeuwen/devel/src/apheleia/kolab.git/src/app/Observers/UserObserver.php:65
/home/vanmeeuwen/devel/src/apheleia/kolab.git/src/vendor/laravel/framework/src/Illuminate/Events/Dispatcher.php:366
/home/vanmeeuwen/devel/src/apheleia/kolab.git/src/vendor/laravel/framework/src/Illuminate/Events/Dispatcher.php:196
/home/vanmeeuwen/devel/src/apheleia/kolab.git/src/vendor/laravel/framework/src/Illuminate/Database/Eloquent/Concerns/HasEvents.php:188
/home/vanmeeuwen/devel/src/apheleia/kolab.git/src/vendor/laravel/framework/src/Illuminate/Database/Eloquent/Model.php:825
/home/vanmeeuwen/devel/src/apheleia/kolab.git/src/vendor/laravel/framework/src/Illuminate/Database/Eloquent/Model.php:667
/home/vanmeeuwen/devel/src/apheleia/kolab.git/src/vendor/laravel/framework/src/Illuminate/Database/Eloquent/Builder.php:422
/home/vanmeeuwen/devel/src/apheleia/kolab.git/src/vendor/laravel/framework/src/Illuminate/Support/helpers.php:1124
/home/vanmeeuwen/devel/src/apheleia/kolab.git/src/vendor/laravel/framework/src/Illuminate/Database/Eloquent/Builder.php:423
/home/vanmeeuwen/devel/src/apheleia/kolab.git/src/vendor/laravel/framework/src/Illuminate/Support/Traits/ForwardsCalls.php:23
/home/vanmeeuwen/devel/src/apheleia/kolab.git/src/vendor/laravel/framework/src/Illuminate/Database/Eloquent/Model.php:1618
/home/vanmeeuwen/devel/src/apheleia/kolab.git/src/vendor/laravel/framework/src/Illuminate/Database/Eloquent/Model.php:1630
/home/vanmeeuwen/devel/src/apheleia/kolab.git/src/tests/Browser/PasswordResetTest.php:25
4) Tests\Browser\PasswordResetTest::testPasswordResetStep1
ErrorException: stream_socket_client(): Filename cannot be empty
/home/vanmeeuwen/devel/src/apheleia/kolab.git/src/include/rcube_imap_generic.php:993
/home/vanmeeuwen/devel/src/apheleia/kolab.git/src/include/rcube_imap_generic.php:880
/home/vanmeeuwen/devel/src/apheleia/kolab.git/src/app/Backends/IMAP.php:51
/home/vanmeeuwen/devel/src/apheleia/kolab.git/src/app/Backends/IMAP.php:20
/home/vanmeeuwen/devel/src/apheleia/kolab.git/src/app/Jobs/ProcessUserVerify.php:48
/home/vanmeeuwen/devel/src/apheleia/kolab.git/src/vendor/laravel/framework/src/Illuminate/Container/BoundMethod.php:32
/home/vanmeeuwen/devel/src/apheleia/kolab.git/src/vendor/laravel/framework/src/Illuminate/Container/BoundMethod.php:90
/home/vanmeeuwen/devel/src/apheleia/kolab.git/src/vendor/laravel/framework/src/Illuminate/Container/BoundMethod.php:34
/home/vanmeeuwen/devel/src/apheleia/kolab.git/src/vendor/laravel/framework/src/Illuminate/Container/Container.php:576
/home/vanmeeuwen/devel/src/apheleia/kolab.git/src/vendor/laravel/framework/src/Illuminate/Bus/Dispatcher.php:94
/home/vanmeeuwen/devel/src/apheleia/kolab.git/src/vendor/laravel/framework/src/Illuminate/Pipeline/Pipeline.php:128
/home/vanmeeuwen/devel/src/apheleia/kolab.git/src/vendor/laravel/framework/src/Illuminate/Pipeline/Pipeline.php:104
/home/vanmeeuwen/devel/src/apheleia/kolab.git/src/vendor/laravel/framework/src/Illuminate/Bus/Dispatcher.php:98
/home/vanmeeuwen/devel/src/apheleia/kolab.git/src/vendor/laravel/framework/src/Illuminate/Queue/CallQueuedHandler.php:49
/home/vanmeeuwen/devel/src/apheleia/kolab.git/src/vendor/laravel/framework/src/Illuminate/Queue/Jobs/Job.php:88
/home/vanmeeuwen/devel/src/apheleia/kolab.git/src/vendor/laravel/framework/src/Illuminate/Queue/SyncQueue.php:42
/home/vanmeeuwen/devel/src/apheleia/kolab.git/src/vendor/laravel/framework/src/Illuminate/Bus/Dispatcher.php:184
/home/vanmeeuwen/devel/src/apheleia/kolab.git/src/vendor/laravel/framework/src/Illuminate/Bus/Dispatcher.php:160
/home/vanmeeuwen/devel/src/apheleia/kolab.git/src/vendor/laravel/framework/src/Illuminate/Bus/Dispatcher.php:73
/home/vanmeeuwen/devel/src/apheleia/kolab.git/src/vendor/laravel/framework/src/Illuminate/Foundation/Bus/PendingDispatch.php:112
/home/vanmeeuwen/devel/src/apheleia/kolab.git/src/vendor/laravel/framework/src/Illuminate/Foundation/helpers.php:399
/home/vanmeeuwen/devel/src/apheleia/kolab.git/src/vendor/laravel/framework/src/Illuminate/Bus/Queueable.php:147
/home/vanmeeuwen/devel/src/apheleia/kolab.git/src/vendor/laravel/framework/src/Illuminate/Queue/CallQueuedHandler.php:104
/home/vanmeeuwen/devel/src/apheleia/kolab.git/src/vendor/laravel/framework/src/Illuminate/Queue/CallQueuedHandler.php:53
/home/vanmeeuwen/devel/src/apheleia/kolab.git/src/vendor/laravel/framework/src/Illuminate/Queue/Jobs/Job.php:88
/home/vanmeeuwen/devel/src/apheleia/kolab.git/src/vendor/laravel/framework/src/Illuminate/Queue/SyncQueue.php:42
/home/vanmeeuwen/devel/src/apheleia/kolab.git/src/vendor/laravel/framework/src/Illuminate/Bus/Dispatcher.php:184
/home/vanmeeuwen/devel/src/apheleia/kolab.git/src/vendor/laravel/framework/src/Illuminate/Bus/Dispatcher.php:160
/home/vanmeeuwen/devel/src/apheleia/kolab.git/src/vendor/laravel/framework/src/Illuminate/Bus/Dispatcher.php:73
/home/vanmeeuwen/devel/src/apheleia/kolab.git/src/vendor/laravel/framework/src/Illuminate/Foundation/Bus/PendingDispatch.php:112
/home/vanmeeuwen/devel/src/apheleia/kolab.git/src/vendor/laravel/framework/src/Illuminate/Foundation/Bus/PendingChain.php:43
/home/vanmeeuwen/devel/src/apheleia/kolab.git/src/app/Observers/UserObserver.php:65
/home/vanmeeuwen/devel/src/apheleia/kolab.git/src/vendor/laravel/framework/src/Illuminate/Events/Dispatcher.php:366
/home/vanmeeuwen/devel/src/apheleia/kolab.git/src/vendor/laravel/framework/src/Illuminate/Events/Dispatcher.php:196
/home/vanmeeuwen/devel/src/apheleia/kolab.git/src/vendor/laravel/framework/src/Illuminate/Database/Eloquent/Concerns/HasEvents.php:188
/home/vanmeeuwen/devel/src/apheleia/kolab.git/src/vendor/laravel/framework/src/Illuminate/Database/Eloquent/Model.php:825
/home/vanmeeuwen/devel/src/apheleia/kolab.git/src/vendor/laravel/framework/src/Illuminate/Database/Eloquent/Model.php:667
/home/vanmeeuwen/devel/src/apheleia/kolab.git/src/vendor/laravel/framework/src/Illuminate/Database/Eloquent/Builder.php:422
/home/vanmeeuwen/devel/src/apheleia/kolab.git/src/vendor/laravel/framework/src/Illuminate/Support/helpers.php:1124
/home/vanmeeuwen/devel/src/apheleia/kolab.git/src/vendor/laravel/framework/src/Illuminate/Database/Eloquent/Builder.php:423
/home/vanmeeuwen/devel/src/apheleia/kolab.git/src/vendor/laravel/framework/src/Illuminate/Support/Traits/ForwardsCalls.php:23
/home/vanmeeuwen/devel/src/apheleia/kolab.git/src/vendor/laravel/framework/src/Illuminate/Database/Eloquent/Model.php:1618
/home/vanmeeuwen/devel/src/apheleia/kolab.git/src/vendor/laravel/framework/src/Illuminate/Database/Eloquent/Model.php:1630
/home/vanmeeuwen/devel/src/apheleia/kolab.git/src/tests/Browser/PasswordResetTest.php:25
5) Tests\Browser\SignupTest::testSignupCodeByLink
Facebook\WebDriver\Exception\TimeOutException: Waited 5 seconds for selector [#error-page].
/home/vanmeeuwen/devel/src/apheleia/kolab.git/src/vendor/laravel/dusk/src/Concerns/WaitsForElements.php:291
/home/vanmeeuwen/devel/src/apheleia/kolab.git/src/vendor/laravel/dusk/src/Concerns/WaitsForElements.php:44
/home/vanmeeuwen/devel/src/apheleia/kolab.git/src/tests/Browser/SignupTest.php:49
/home/vanmeeuwen/devel/src/apheleia/kolab.git/src/vendor/laravel/dusk/src/Concerns/ProvidesBrowser.php:68
/home/vanmeeuwen/devel/src/apheleia/kolab.git/src/tests/Browser/SignupTest.php:50
6) Tests\Browser\SignupTest::testSignupStep1
Facebook\WebDriver\Exception\NoSuchElementException: no such element: Unable to locate element: {"method":"css selector","selector":"body #step1"}
(Session info: headless chrome=78.0.3904.108)
(Driver info: chromedriver=78.0.3904.105 (60e2d8774a8151efa6a00b1f358371b1e0e07ee2-refs/branch-heads/3904@{#877}),platform=Linux 5.3.16-200.fc30.x86_64 x86_64)
/home/vanmeeuwen/devel/src/apheleia/kolab.git/src/vendor/php-webdriver/webdriver/lib/Exception/WebDriverException.php:102
/home/vanmeeuwen/devel/src/apheleia/kolab.git/src/vendor/php-webdriver/webdriver/lib/Remote/HttpCommandExecutor.php:331
/home/vanmeeuwen/devel/src/apheleia/kolab.git/src/vendor/php-webdriver/webdriver/lib/Remote/RemoteWebDriver.php:565
/home/vanmeeuwen/devel/src/apheleia/kolab.git/src/vendor/php-webdriver/webdriver/lib/Remote/RemoteWebDriver.php:204
/home/vanmeeuwen/devel/src/apheleia/kolab.git/src/vendor/laravel/dusk/src/ElementResolver.php:373
/home/vanmeeuwen/devel/src/apheleia/kolab.git/src/vendor/laravel/dusk/src/Concerns/MakesAssertions.php:562
/home/vanmeeuwen/devel/src/apheleia/kolab.git/src/tests/Browser/SignupTest.php:150
/home/vanmeeuwen/devel/src/apheleia/kolab.git/src/vendor/laravel/dusk/src/Concerns/ProvidesBrowser.php:68
/home/vanmeeuwen/devel/src/apheleia/kolab.git/src/tests/Browser/SignupTest.php:201
7) Tests\Feature\Backends\IMAPTest::testVerifyAccountExisting
ErrorException: stream_socket_client(): Filename cannot be empty
/home/vanmeeuwen/devel/src/apheleia/kolab.git/src/include/rcube_imap_generic.php:993
/home/vanmeeuwen/devel/src/apheleia/kolab.git/src/include/rcube_imap_generic.php:880
/home/vanmeeuwen/devel/src/apheleia/kolab.git/src/app/Backends/IMAP.php:51
/home/vanmeeuwen/devel/src/apheleia/kolab.git/src/app/Backends/IMAP.php:20
/home/vanmeeuwen/devel/src/apheleia/kolab.git/src/tests/Feature/Backends/IMAPTest.php:17
8) Tests\Feature\Controller\SignupTest::testSignupValidInput
Symfony\Component\Debug\Exception\FatalThrowableError: Class name must be a valid object or a string
/home/vanmeeuwen/devel/src/apheleia/kolab.git/src/app/Sku.php:69
/home/vanmeeuwen/devel/src/apheleia/kolab.git/src/app/Http/Controllers/API/SignupController.php:226
/home/vanmeeuwen/devel/src/apheleia/kolab.git/src/vendor/laravel/framework/src/Illuminate/Routing/Controller.php:54
/home/vanmeeuwen/devel/src/apheleia/kolab.git/src/vendor/laravel/framework/src/Illuminate/Routing/ControllerDispatcher.php:45
/home/vanmeeuwen/devel/src/apheleia/kolab.git/src/vendor/laravel/framework/src/Illuminate/Routing/Route.php:219
/home/vanmeeuwen/devel/src/apheleia/kolab.git/src/vendor/laravel/framework/src/Illuminate/Routing/Route.php:176
/home/vanmeeuwen/devel/src/apheleia/kolab.git/src/vendor/laravel/framework/src/Illuminate/Routing/Router.php:680
/home/vanmeeuwen/devel/src/apheleia/kolab.git/src/vendor/laravel/framework/src/Illuminate/Routing/Pipeline.php:30
/home/vanmeeuwen/devel/src/apheleia/kolab.git/src/vendor/laravel/framework/src/Illuminate/Routing/Middleware/SubstituteBindings.php:41
/home/vanmeeuwen/devel/src/apheleia/kolab.git/src/vendor/laravel/framework/src/Illuminate/Pipeline/Pipeline.php:163
/home/vanmeeuwen/devel/src/apheleia/kolab.git/src/vendor/laravel/framework/src/Illuminate/Routing/Pipeline.php:53
/home/vanmeeuwen/devel/src/apheleia/kolab.git/src/vendor/laravel/framework/src/Illuminate/Routing/Middleware/ThrottleRequests.php:58
/home/vanmeeuwen/devel/src/apheleia/kolab.git/src/vendor/laravel/framework/src/Illuminate/Pipeline/Pipeline.php:163
/home/vanmeeuwen/devel/src/apheleia/kolab.git/src/vendor/laravel/framework/src/Illuminate/Routing/Pipeline.php:53
/home/vanmeeuwen/devel/src/apheleia/kolab.git/src/vendor/laravel/framework/src/Illuminate/Pipeline/Pipeline.php:104
/home/vanmeeuwen/devel/src/apheleia/kolab.git/src/vendor/laravel/framework/src/Illuminate/Routing/Router.php:682
/home/vanmeeuwen/devel/src/apheleia/kolab.git/src/vendor/laravel/framework/src/Illuminate/Routing/Router.php:657
/home/vanmeeuwen/devel/src/apheleia/kolab.git/src/vendor/laravel/framework/src/Illuminate/Routing/Router.php:623
/home/vanmeeuwen/devel/src/apheleia/kolab.git/src/vendor/laravel/framework/src/Illuminate/Routing/Router.php:612
/home/vanmeeuwen/devel/src/apheleia/kolab.git/src/vendor/laravel/framework/src/Illuminate/Foundation/Http/Kernel.php:176
/home/vanmeeuwen/devel/src/apheleia/kolab.git/src/vendor/laravel/framework/src/Illuminate/Routing/Pipeline.php:30
/home/vanmeeuwen/devel/src/apheleia/kolab.git/src/vendor/laravel/framework/src/Illuminate/Foundation/Http/Middleware/TransformsRequest.php:21
/home/vanmeeuwen/devel/src/apheleia/kolab.git/src/vendor/laravel/framework/src/Illuminate/Pipeline/Pipeline.php:163
/home/vanmeeuwen/devel/src/apheleia/kolab.git/src/vendor/laravel/framework/src/Illuminate/Routing/Pipeline.php:53
/home/vanmeeuwen/devel/src/apheleia/kolab.git/src/vendor/laravel/framework/src/Illuminate/Foundation/Http/Middleware/TransformsRequest.php:21
/home/vanmeeuwen/devel/src/apheleia/kolab.git/src/vendor/laravel/framework/src/Illuminate/Pipeline/Pipeline.php:163
/home/vanmeeuwen/devel/src/apheleia/kolab.git/src/vendor/laravel/framework/src/Illuminate/Routing/Pipeline.php:53
/home/vanmeeuwen/devel/src/apheleia/kolab.git/src/vendor/laravel/framework/src/Illuminate/Foundation/Http/Middleware/ValidatePostSize.php:27
/home/vanmeeuwen/devel/src/apheleia/kolab.git/src/vendor/laravel/framework/src/Illuminate/Pipeline/Pipeline.php:163
/home/vanmeeuwen/devel/src/apheleia/kolab.git/src/vendor/laravel/framework/src/Illuminate/Routing/Pipeline.php:53
/home/vanmeeuwen/devel/src/apheleia/kolab.git/src/vendor/laravel/framework/src/Illuminate/Foundation/Http/Middleware/CheckForMaintenanceMode.php:62
/home/vanmeeuwen/devel/src/apheleia/kolab.git/src/vendor/laravel/framework/src/Illuminate/Pipeline/Pipeline.php:163
/home/vanmeeuwen/devel/src/apheleia/kolab.git/src/vendor/laravel/framework/src/Illuminate/Routing/Pipeline.php:53
/home/vanmeeuwen/devel/src/apheleia/kolab.git/src/vendor/fideloper/proxy/src/TrustProxies.php:57
/home/vanmeeuwen/devel/src/apheleia/kolab.git/src/vendor/laravel/framework/src/Illuminate/Pipeline/Pipeline.php:163
/home/vanmeeuwen/devel/src/apheleia/kolab.git/src/vendor/laravel/framework/src/Illuminate/Routing/Pipeline.php:53
/home/vanmeeuwen/devel/src/apheleia/kolab.git/src/app/Http/Middleware/RequestLogger.php:11
/home/vanmeeuwen/devel/src/apheleia/kolab.git/src/vendor/laravel/framework/src/Illuminate/Pipeline/Pipeline.php:163
/home/vanmeeuwen/devel/src/apheleia/kolab.git/src/vendor/laravel/framework/src/Illuminate/Routing/Pipeline.php:53
/home/vanmeeuwen/devel/src/apheleia/kolab.git/src/vendor/laravel/framework/src/Illuminate/Pipeline/Pipeline.php:104
/home/vanmeeuwen/devel/src/apheleia/kolab.git/src/vendor/laravel/framework/src/Illuminate/Foundation/Http/Kernel.php:151
/home/vanmeeuwen/devel/src/apheleia/kolab.git/src/vendor/laravel/framework/src/Illuminate/Foundation/Http/Kernel.php:116
/home/vanmeeuwen/devel/src/apheleia/kolab.git/src/vendor/laravel/framework/src/Illuminate/Foundation/Testing/Concerns/MakesHttpRequests.php:375
/home/vanmeeuwen/devel/src/apheleia/kolab.git/src/vendor/laravel/framework/src/Illuminate/Foundation/Testing/Concerns/MakesHttpRequests.php:197
/home/vanmeeuwen/devel/src/apheleia/kolab.git/src/tests/Feature/Controller/SignupTest.php:403
9) Tests\Feature\Controller\SignupTest::testSignupGroupAccount
Illuminate\Database\QueryException: SQLSTATE[HY000]: General error: 1205 Lock wait timeout exceeded; try restarting transaction (SQL: insert into `users` (`name`, `email`, `password`, `password_ldap`, `id`, `status`, `updated_at`, `created_at`) values (Signup User, admin@external.com, $2y$12$QGwxqwnv.OCaxJ21ybFqSulbBwbb5qOCmsPb2I1LAprV4bacus7Z6, {SSHA512}7iaw3Ur350mqGo7jwQrpkj9hiYB3Lkc/iBml1JQODbJ6wYX4oOHV+E+IvIh/1nsUNzLDBMxfqa2Ob1f1ACio/w==, 2412517572, 1, 2020-02-10 08:26:18, 2020-02-10 08:26:18))
/home/vanmeeuwen/devel/src/apheleia/kolab.git/src/vendor/laravel/framework/src/Illuminate/Database/Connection.php:664
/home/vanmeeuwen/devel/src/apheleia/kolab.git/src/vendor/laravel/framework/src/Illuminate/Database/Connection.php:624
/home/vanmeeuwen/devel/src/apheleia/kolab.git/src/vendor/laravel/framework/src/Illuminate/Database/Connection.php:459
/home/vanmeeuwen/devel/src/apheleia/kolab.git/src/vendor/laravel/framework/src/Illuminate/Database/Connection.php:411
/home/vanmeeuwen/devel/src/apheleia/kolab.git/src/vendor/laravel/framework/src/Illuminate/Database/Query/Builder.php:2646
/home/vanmeeuwen/devel/src/apheleia/kolab.git/src/vendor/laravel/framework/src/Illuminate/Database/Eloquent/Builder.php:1353
/home/vanmeeuwen/devel/src/apheleia/kolab.git/src/vendor/laravel/framework/src/Illuminate/Database/Eloquent/Model.php:815
/home/vanmeeuwen/devel/src/apheleia/kolab.git/src/vendor/laravel/framework/src/Illuminate/Database/Eloquent/Model.php:667
/home/vanmeeuwen/devel/src/apheleia/kolab.git/src/vendor/laravel/framework/src/Illuminate/Database/Eloquent/Builder.php:795
/home/vanmeeuwen/devel/src/apheleia/kolab.git/src/vendor/laravel/framework/src/Illuminate/Support/helpers.php:1124
/home/vanmeeuwen/devel/src/apheleia/kolab.git/src/vendor/laravel/framework/src/Illuminate/Database/Eloquent/Builder.php:796
/home/vanmeeuwen/devel/src/apheleia/kolab.git/src/vendor/laravel/framework/src/Illuminate/Support/Traits/ForwardsCalls.php:23
/home/vanmeeuwen/devel/src/apheleia/kolab.git/src/vendor/laravel/framework/src/Illuminate/Database/Eloquent/Model.php:1618
/home/vanmeeuwen/devel/src/apheleia/kolab.git/src/vendor/laravel/framework/src/Illuminate/Database/Eloquent/Model.php:1630
/home/vanmeeuwen/devel/src/apheleia/kolab.git/src/app/Http/Controllers/API/SignupController.php:210
/home/vanmeeuwen/devel/src/apheleia/kolab.git/src/vendor/laravel/framework/src/Illuminate/Routing/Controller.php:54
/home/vanmeeuwen/devel/src/apheleia/kolab.git/src/vendor/laravel/framework/src/Illuminate/Routing/ControllerDispatcher.php:45
/home/vanmeeuwen/devel/src/apheleia/kolab.git/src/vendor/laravel/framework/src/Illuminate/Routing/Route.php:219
/home/vanmeeuwen/devel/src/apheleia/kolab.git/src/vendor/laravel/framework/src/Illuminate/Routing/Route.php:176
/home/vanmeeuwen/devel/src/apheleia/kolab.git/src/vendor/laravel/framework/src/Illuminate/Routing/Router.php:680
/home/vanmeeuwen/devel/src/apheleia/kolab.git/src/vendor/laravel/framework/src/Illuminate/Routing/Pipeline.php:30
/home/vanmeeuwen/devel/src/apheleia/kolab.git/src/vendor/laravel/framework/src/Illuminate/Routing/Middleware/SubstituteBindings.php:41
/home/vanmeeuwen/devel/src/apheleia/kolab.git/src/vendor/laravel/framework/src/Illuminate/Pipeline/Pipeline.php:163
/home/vanmeeuwen/devel/src/apheleia/kolab.git/src/vendor/laravel/framework/src/Illuminate/Routing/Pipeline.php:53
/home/vanmeeuwen/devel/src/apheleia/kolab.git/src/vendor/laravel/framework/src/Illuminate/Routing/Middleware/ThrottleRequests.php:58
/home/vanmeeuwen/devel/src/apheleia/kolab.git/src/vendor/laravel/framework/src/Illuminate/Pipeline/Pipeline.php:163
/home/vanmeeuwen/devel/src/apheleia/kolab.git/src/vendor/laravel/framework/src/Illuminate/Routing/Pipeline.php:53
/home/vanmeeuwen/devel/src/apheleia/kolab.git/src/vendor/laravel/framework/src/Illuminate/Pipeline/Pipeline.php:104
/home/vanmeeuwen/devel/src/apheleia/kolab.git/src/vendor/laravel/framework/src/Illuminate/Routing/Router.php:682
/home/vanmeeuwen/devel/src/apheleia/kolab.git/src/vendor/laravel/framework/src/Illuminate/Routing/Router.php:657
/home/vanmeeuwen/devel/src/apheleia/kolab.git/src/vendor/laravel/framework/src/Illuminate/Routing/Router.php:623
/home/vanmeeuwen/devel/src/apheleia/kolab.git/src/vendor/laravel/framework/src/Illuminate/Routing/Router.php:612
/home/vanmeeuwen/devel/src/apheleia/kolab.git/src/vendor/laravel/framework/src/Illuminate/Foundation/Http/Kernel.php:176
/home/vanmeeuwen/devel/src/apheleia/kolab.git/src/vendor/laravel/framework/src/Illuminate/Routing/Pipeline.php:30
/home/vanmeeuwen/devel/src/apheleia/kolab.git/src/vendor/laravel/framework/src/Illuminate/Foundation/Http/Middleware/TransformsRequest.php:21
/home/vanmeeuwen/devel/src/apheleia/kolab.git/src/vendor/laravel/framework/src/Illuminate/Pipeline/Pipeline.php:163
/home/vanmeeuwen/devel/src/apheleia/kolab.git/src/vendor/laravel/framework/src/Illuminate/Routing/Pipeline.php:53
/home/vanmeeuwen/devel/src/apheleia/kolab.git/src/vendor/laravel/framework/src/Illuminate/Foundation/Http/Middleware/TransformsRequest.php:21
/home/vanmeeuwen/devel/src/apheleia/kolab.git/src/vendor/laravel/framework/src/Illuminate/Pipeline/Pipeline.php:163
/home/vanmeeuwen/devel/src/apheleia/kolab.git/src/vendor/laravel/framework/src/Illuminate/Routing/Pipeline.php:53
/home/vanmeeuwen/devel/src/apheleia/kolab.git/src/vendor/laravel/framework/src/Illuminate/Foundation/Http/Middleware/ValidatePostSize.php:27
/home/vanmeeuwen/devel/src/apheleia/kolab.git/src/vendor/laravel/framework/src/Illuminate/Pipeline/Pipeline.php:163
/home/vanmeeuwen/devel/src/apheleia/kolab.git/src/vendor/laravel/framework/src/Illuminate/Routing/Pipeline.php:53
/home/vanmeeuwen/devel/src/apheleia/kolab.git/src/vendor/laravel/framework/src/Illuminate/Foundation/Http/Middleware/CheckForMaintenanceMode.php:62
/home/vanmeeuwen/devel/src/apheleia/kolab.git/src/vendor/laravel/framework/src/Illuminate/Pipeline/Pipeline.php:163
/home/vanmeeuwen/devel/src/apheleia/kolab.git/src/vendor/laravel/framework/src/Illuminate/Routing/Pipeline.php:53
/home/vanmeeuwen/devel/src/apheleia/kolab.git/src/vendor/fideloper/proxy/src/TrustProxies.php:57
/home/vanmeeuwen/devel/src/apheleia/kolab.git/src/vendor/laravel/framework/src/Illuminate/Pipeline/Pipeline.php:163
/home/vanmeeuwen/devel/src/apheleia/kolab.git/src/vendor/laravel/framework/src/Illuminate/Routing/Pipeline.php:53
/home/vanmeeuwen/devel/src/apheleia/kolab.git/src/app/Http/Middleware/RequestLogger.php:11
/home/vanmeeuwen/devel/src/apheleia/kolab.git/src/vendor/laravel/framework/src/Illuminate/Pipeline/Pipeline.php:163
/home/vanmeeuwen/devel/src/apheleia/kolab.git/src/vendor/laravel/framework/src/Illuminate/Routing/Pipeline.php:53
/home/vanmeeuwen/devel/src/apheleia/kolab.git/src/vendor/laravel/framework/src/Illuminate/Pipeline/Pipeline.php:104
/home/vanmeeuwen/devel/src/apheleia/kolab.git/src/vendor/laravel/framework/src/Illuminate/Foundation/Http/Kernel.php:151
/home/vanmeeuwen/devel/src/apheleia/kolab.git/src/vendor/laravel/framework/src/Illuminate/Foundation/Http/Kernel.php:116
/home/vanmeeuwen/devel/src/apheleia/kolab.git/src/vendor/laravel/framework/src/Illuminate/Foundation/Testing/Concerns/MakesHttpRequests.php:375
/home/vanmeeuwen/devel/src/apheleia/kolab.git/src/vendor/laravel/framework/src/Illuminate/Foundation/Testing/Concerns/MakesHttpRequests.php:197
/home/vanmeeuwen/devel/src/apheleia/kolab.git/src/tests/Feature/Controller/SignupTest.php:505
Caused by
Doctrine\DBAL\Driver\PDOException: SQLSTATE[HY000]: General error: 1205 Lock wait timeout exceeded; try restarting transaction
/home/vanmeeuwen/devel/src/apheleia/kolab.git/src/vendor/doctrine/dbal/lib/Doctrine/DBAL/Driver/PDOStatement.php:123
/home/vanmeeuwen/devel/src/apheleia/kolab.git/src/vendor/laravel/framework/src/Illuminate/Database/Connection.php:458
/home/vanmeeuwen/devel/src/apheleia/kolab.git/src/vendor/laravel/framework/src/Illuminate/Database/Connection.php:657
/home/vanmeeuwen/devel/src/apheleia/kolab.git/src/vendor/laravel/framework/src/Illuminate/Database/Connection.php:624
/home/vanmeeuwen/devel/src/apheleia/kolab.git/src/vendor/laravel/framework/src/Illuminate/Database/Connection.php:459
/home/vanmeeuwen/devel/src/apheleia/kolab.git/src/vendor/laravel/framework/src/Illuminate/Database/Connection.php:411
/home/vanmeeuwen/devel/src/apheleia/kolab.git/src/vendor/laravel/framework/src/Illuminate/Database/Query/Builder.php:2646
/home/vanmeeuwen/devel/src/apheleia/kolab.git/src/vendor/laravel/framework/src/Illuminate/Database/Eloquent/Builder.php:1353
/home/vanmeeuwen/devel/src/apheleia/kolab.git/src/vendor/laravel/framework/src/Illuminate/Database/Eloquent/Model.php:815
/home/vanmeeuwen/devel/src/apheleia/kolab.git/src/vendor/laravel/framework/src/Illuminate/Database/Eloquent/Model.php:667
/home/vanmeeuwen/devel/src/apheleia/kolab.git/src/vendor/laravel/framework/src/Illuminate/Database/Eloquent/Builder.php:795
/home/vanmeeuwen/devel/src/apheleia/kolab.git/src/vendor/laravel/framework/src/Illuminate/Support/helpers.php:1124
/home/vanmeeuwen/devel/src/apheleia/kolab.git/src/vendor/laravel/framework/src/Illuminate/Database/Eloquent/Builder.php:796
/home/vanmeeuwen/devel/src/apheleia/kolab.git/src/vendor/laravel/framework/src/Illuminate/Support/Traits/ForwardsCalls.php:23
/home/vanmeeuwen/devel/src/apheleia/kolab.git/src/vendor/laravel/framework/src/Illuminate/Database/Eloquent/Model.php:1618
/home/vanmeeuwen/devel/src/apheleia/kolab.git/src/vendor/laravel/framework/src/Illuminate/Database/Eloquent/Model.php:1630
/home/vanmeeuwen/devel/src/apheleia/kolab.git/src/app/Http/Controllers/API/SignupController.php:210
/home/vanmeeuwen/devel/src/apheleia/kolab.git/src/vendor/laravel/framework/src/Illuminate/Routing/Controller.php:54
/home/vanmeeuwen/devel/src/apheleia/kolab.git/src/vendor/laravel/framework/src/Illuminate/Routing/ControllerDispatcher.php:45
/home/vanmeeuwen/devel/src/apheleia/kolab.git/src/vendor/laravel/framework/src/Illuminate/Routing/Route.php:219
/home/vanmeeuwen/devel/src/apheleia/kolab.git/src/vendor/laravel/framework/src/Illuminate/Routing/Route.php:176
/home/vanmeeuwen/devel/src/apheleia/kolab.git/src/vendor/laravel/framework/src/Illuminate/Routing/Router.php:680
/home/vanmeeuwen/devel/src/apheleia/kolab.git/src/vendor/laravel/framework/src/Illuminate/Routing/Pipeline.php:30
/home/vanmeeuwen/devel/src/apheleia/kolab.git/src/vendor/laravel/framework/src/Illuminate/Routing/Middleware/SubstituteBindings.php:41
/home/vanmeeuwen/devel/src/apheleia/kolab.git/src/vendor/laravel/framework/src/Illuminate/Pipeline/Pipeline.php:163
/home/vanmeeuwen/devel/src/apheleia/kolab.git/src/vendor/laravel/framework/src/Illuminate/Routing/Pipeline.php:53
/home/vanmeeuwen/devel/src/apheleia/kolab.git/src/vendor/laravel/framework/src/Illuminate/Routing/Middleware/ThrottleRequests.php:58
/home/vanmeeuwen/devel/src/apheleia/kolab.git/src/vendor/laravel/framework/src/Illuminate/Pipeline/Pipeline.php:163
/home/vanmeeuwen/devel/src/apheleia/kolab.git/src/vendor/laravel/framework/src/Illuminate/Routing/Pipeline.php:53
/home/vanmeeuwen/devel/src/apheleia/kolab.git/src/vendor/laravel/framework/src/Illuminate/Pipeline/Pipeline.php:104
/home/vanmeeuwen/devel/src/apheleia/kolab.git/src/vendor/laravel/framework/src/Illuminate/Routing/Router.php:682
/home/vanmeeuwen/devel/src/apheleia/kolab.git/src/vendor/laravel/framework/src/Illuminate/Routing/Router.php:657
/home/vanmeeuwen/devel/src/apheleia/kolab.git/src/vendor/laravel/framework/src/Illuminate/Routing/Router.php:623
/home/vanmeeuwen/devel/src/apheleia/kolab.git/src/vendor/laravel/framework/src/Illuminate/Routing/Router.php:612
/home/vanmeeuwen/devel/src/apheleia/kolab.git/src/vendor/laravel/framework/src/Illuminate/Foundation/Http/Kernel.php:176
/home/vanmeeuwen/devel/src/apheleia/kolab.git/src/vendor/laravel/framework/src/Illuminate/Routing/Pipeline.php:30
/home/vanmeeuwen/devel/src/apheleia/kolab.git/src/vendor/laravel/framework/src/Illuminate/Foundation/Http/Middleware/TransformsRequest.php:21
/home/vanmeeuwen/devel/src/apheleia/kolab.git/src/vendor/laravel/framework/src/Illuminate/Pipeline/Pipeline.php:163
/home/vanmeeuwen/devel/src/apheleia/kolab.git/src/vendor/laravel/framework/src/Illuminate/Routing/Pipeline.php:53
/home/vanmeeuwen/devel/src/apheleia/kolab.git/src/vendor/laravel/framework/src/Illuminate/Foundation/Http/Middleware/TransformsRequest.php:21
/home/vanmeeuwen/devel/src/apheleia/kolab.git/src/vendor/laravel/framework/src/Illuminate/Pipeline/Pipeline.php:163
/home/vanmeeuwen/devel/src/apheleia/kolab.git/src/vendor/laravel/framework/src/Illuminate/Routing/Pipeline.php:53
/home/vanmeeuwen/devel/src/apheleia/kolab.git/src/vendor/laravel/framework/src/Illuminate/Foundation/Http/Middleware/ValidatePostSize.php:27
/home/vanmeeuwen/devel/src/apheleia/kolab.git/src/vendor/laravel/framework/src/Illuminate/Pipeline/Pipeline.php:163
/home/vanmeeuwen/devel/src/apheleia/kolab.git/src/vendor/laravel/framework/src/Illuminate/Routing/Pipeline.php:53
/home/vanmeeuwen/devel/src/apheleia/kolab.git/src/vendor/laravel/framework/src/Illuminate/Foundation/Http/Middleware/CheckForMaintenanceMode.php:62
/home/vanmeeuwen/devel/src/apheleia/kolab.git/src/vendor/laravel/framework/src/Illuminate/Pipeline/Pipeline.php:163
/home/vanmeeuwen/devel/src/apheleia/kolab.git/src/vendor/laravel/framework/src/Illuminate/Routing/Pipeline.php:53
/home/vanmeeuwen/devel/src/apheleia/kolab.git/src/vendor/fideloper/proxy/src/TrustProxies.php:57
/home/vanmeeuwen/devel/src/apheleia/kolab.git/src/vendor/laravel/framework/src/Illuminate/Pipeline/Pipeline.php:163
/home/vanmeeuwen/devel/src/apheleia/kolab.git/src/vendor/laravel/framework/src/Illuminate/Routing/Pipeline.php:53
/home/vanmeeuwen/devel/src/apheleia/kolab.git/src/app/Http/Middleware/RequestLogger.php:11
/home/vanmeeuwen/devel/src/apheleia/kolab.git/src/vendor/laravel/framework/src/Illuminate/Pipeline/Pipeline.php:163
/home/vanmeeuwen/devel/src/apheleia/kolab.git/src/vendor/laravel/framework/src/Illuminate/Routing/Pipeline.php:53
/home/vanmeeuwen/devel/src/apheleia/kolab.git/src/vendor/laravel/framework/src/Illuminate/Pipeline/Pipeline.php:104
/home/vanmeeuwen/devel/src/apheleia/kolab.git/src/vendor/laravel/framework/src/Illuminate/Foundation/Http/Kernel.php:151
/home/vanmeeuwen/devel/src/apheleia/kolab.git/src/vendor/laravel/framework/src/Illuminate/Foundation/Http/Kernel.php:116
/home/vanmeeuwen/devel/src/apheleia/kolab.git/src/vendor/laravel/framework/src/Illuminate/Foundation/Testing/Concerns/MakesHttpRequests.php:375
/home/vanmeeuwen/devel/src/apheleia/kolab.git/src/vendor/laravel/framework/src/Illuminate/Foundation/Testing/Concerns/MakesHttpRequests.php:197
/home/vanmeeuwen/devel/src/apheleia/kolab.git/src/tests/Feature/Controller/SignupTest.php:505
Caused by
PDOException: SQLSTATE[HY000]: General error: 1205 Lock wait timeout exceeded; try restarting transaction
/home/vanmeeuwen/devel/src/apheleia/kolab.git/src/vendor/doctrine/dbal/lib/Doctrine/DBAL/Driver/PDOStatement.php:121
/home/vanmeeuwen/devel/src/apheleia/kolab.git/src/vendor/laravel/framework/src/Illuminate/Database/Connection.php:458
/home/vanmeeuwen/devel/src/apheleia/kolab.git/src/vendor/laravel/framework/src/Illuminate/Database/Connection.php:657
/home/vanmeeuwen/devel/src/apheleia/kolab.git/src/vendor/laravel/framework/src/Illuminate/Database/Connection.php:624
/home/vanmeeuwen/devel/src/apheleia/kolab.git/src/vendor/laravel/framework/src/Illuminate/Database/Connection.php:459
/home/vanmeeuwen/devel/src/apheleia/kolab.git/src/vendor/laravel/framework/src/Illuminate/Database/Connection.php:411
/home/vanmeeuwen/devel/src/apheleia/kolab.git/src/vendor/laravel/framework/src/Illuminate/Database/Query/Builder.php:2646
/home/vanmeeuwen/devel/src/apheleia/kolab.git/src/vendor/laravel/framework/src/Illuminate/Database/Eloquent/Builder.php:1353
/home/vanmeeuwen/devel/src/apheleia/kolab.git/src/vendor/laravel/framework/src/Illuminate/Database/Eloquent/Model.php:815
/home/vanmeeuwen/devel/src/apheleia/kolab.git/src/vendor/laravel/framework/src/Illuminate/Database/Eloquent/Model.php:667
/home/vanmeeuwen/devel/src/apheleia/kolab.git/src/vendor/laravel/framework/src/Illuminate/Database/Eloquent/Builder.php:795
/home/vanmeeuwen/devel/src/apheleia/kolab.git/src/vendor/laravel/framework/src/Illuminate/Support/helpers.php:1124
/home/vanmeeuwen/devel/src/apheleia/kolab.git/src/vendor/laravel/framework/src/Illuminate/Database/Eloquent/Builder.php:796
/home/vanmeeuwen/devel/src/apheleia/kolab.git/src/vendor/laravel/framework/src/Illuminate/Support/Traits/ForwardsCalls.php:23
/home/vanmeeuwen/devel/src/apheleia/kolab.git/src/vendor/laravel/framework/src/Illuminate/Database/Eloquent/Model.php:1618
/home/vanmeeuwen/devel/src/apheleia/kolab.git/src/vendor/laravel/framework/src/Illuminate/Database/Eloquent/Model.php:1630
/home/vanmeeuwen/devel/src/apheleia/kolab.git/src/app/Http/Controllers/API/SignupController.php:210
/home/vanmeeuwen/devel/src/apheleia/kolab.git/src/vendor/laravel/framework/src/Illuminate/Routing/Controller.php:54
/home/vanmeeuwen/devel/src/apheleia/kolab.git/src/vendor/laravel/framework/src/Illuminate/Routing/ControllerDispatcher.php:45
/home/vanmeeuwen/devel/src/apheleia/kolab.git/src/vendor/laravel/framework/src/Illuminate/Routing/Route.php:219
/home/vanmeeuwen/devel/src/apheleia/kolab.git/src/vendor/laravel/framework/src/Illuminate/Routing/Route.php:176
/home/vanmeeuwen/devel/src/apheleia/kolab.git/src/vendor/laravel/framework/src/Illuminate/Routing/Router.php:680
/home/vanmeeuwen/devel/src/apheleia/kolab.git/src/vendor/laravel/framework/src/Illuminate/Routing/Pipeline.php:30
/home/vanmeeuwen/devel/src/apheleia/kolab.git/src/vendor/laravel/framework/src/Illuminate/Routing/Middleware/SubstituteBindings.php:41
/home/vanmeeuwen/devel/src/apheleia/kolab.git/src/vendor/laravel/framework/src/Illuminate/Pipeline/Pipeline.php:163
/home/vanmeeuwen/devel/src/apheleia/kolab.git/src/vendor/laravel/framework/src/Illuminate/Routing/Pipeline.php:53
/home/vanmeeuwen/devel/src/apheleia/kolab.git/src/vendor/laravel/framework/src/Illuminate/Routing/Middleware/ThrottleRequests.php:58
/home/vanmeeuwen/devel/src/apheleia/kolab.git/src/vendor/laravel/framework/src/Illuminate/Pipeline/Pipeline.php:163
/home/vanmeeuwen/devel/src/apheleia/kolab.git/src/vendor/laravel/framework/src/Illuminate/Routing/Pipeline.php:53
/home/vanmeeuwen/devel/src/apheleia/kolab.git/src/vendor/laravel/framework/src/Illuminate/Pipeline/Pipeline.php:104
/home/vanmeeuwen/devel/src/apheleia/kolab.git/src/vendor/laravel/framework/src/Illuminate/Routing/Router.php:682
/home/vanmeeuwen/devel/src/apheleia/kolab.git/src/vendor/laravel/framework/src/Illuminate/Routing/Router.php:657
/home/vanmeeuwen/devel/src/apheleia/kolab.git/src/vendor/laravel/framework/src/Illuminate/Routing/Router.php:623
/home/vanmeeuwen/devel/src/apheleia/kolab.git/src/vendor/laravel/framework/src/Illuminate/Routing/Router.php:612
/home/vanmeeuwen/devel/src/apheleia/kolab.git/src/vendor/laravel/framework/src/Illuminate/Foundation/Http/Kernel.php:176
/home/vanmeeuwen/devel/src/apheleia/kolab.git/src/vendor/laravel/framework/src/Illuminate/Routing/Pipeline.php:30
/home/vanmeeuwen/devel/src/apheleia/kolab.git/src/vendor/laravel/framework/src/Illuminate/Foundation/Http/Middleware/TransformsRequest.php:21
/home/vanmeeuwen/devel/src/apheleia/kolab.git/src/vendor/laravel/framework/src/Illuminate/Pipeline/Pipeline.php:163
/home/vanmeeuwen/devel/src/apheleia/kolab.git/src/vendor/laravel/framework/src/Illuminate/Routing/Pipeline.php:53
/home/vanmeeuwen/devel/src/apheleia/kolab.git/src/vendor/laravel/framework/src/Illuminate/Foundation/Http/Middleware/TransformsRequest.php:21
/home/vanmeeuwen/devel/src/apheleia/kolab.git/src/vendor/laravel/framework/src/Illuminate/Pipeline/Pipeline.php:163
/home/vanmeeuwen/devel/src/apheleia/kolab.git/src/vendor/laravel/framework/src/Illuminate/Routing/Pipeline.php:53
/home/vanmeeuwen/devel/src/apheleia/kolab.git/src/vendor/laravel/framework/src/Illuminate/Foundation/Http/Middleware/ValidatePostSize.php:27
/home/vanmeeuwen/devel/src/apheleia/kolab.git/src/vendor/laravel/framework/src/Illuminate/Pipeline/Pipeline.php:163
/home/vanmeeuwen/devel/src/apheleia/kolab.git/src/vendor/laravel/framework/src/Illuminate/Routing/Pipeline.php:53
/home/vanmeeuwen/devel/src/apheleia/kolab.git/src/vendor/laravel/framework/src/Illuminate/Foundation/Http/Middleware/CheckForMaintenanceMode.php:62
/home/vanmeeuwen/devel/src/apheleia/kolab.git/src/vendor/laravel/framework/src/Illuminate/Pipeline/Pipeline.php:163
/home/vanmeeuwen/devel/src/apheleia/kolab.git/src/vendor/laravel/framework/src/Illuminate/Routing/Pipeline.php:53
/home/vanmeeuwen/devel/src/apheleia/kolab.git/src/vendor/fideloper/proxy/src/TrustProxies.php:57
/home/vanmeeuwen/devel/src/apheleia/kolab.git/src/vendor/laravel/framework/src/Illuminate/Pipeline/Pipeline.php:163
/home/vanmeeuwen/devel/src/apheleia/kolab.git/src/vendor/laravel/framework/src/Illuminate/Routing/Pipeline.php:53
/home/vanmeeuwen/devel/src/apheleia/kolab.git/src/app/Http/Middleware/RequestLogger.php:11
/home/vanmeeuwen/devel/src/apheleia/kolab.git/src/vendor/laravel/framework/src/Illuminate/Pipeline/Pipeline.php:163
/home/vanmeeuwen/devel/src/apheleia/kolab.git/src/vendor/laravel/framework/src/Illuminate/Routing/Pipeline.php:53
/home/vanmeeuwen/devel/src/apheleia/kolab.git/src/vendor/laravel/framework/src/Illuminate/Pipeline/Pipeline.php:104
/home/vanmeeuwen/devel/src/apheleia/kolab.git/src/vendor/laravel/framework/src/Illuminate/Foundation/Http/Kernel.php:151
/home/vanmeeuwen/devel/src/apheleia/kolab.git/src/vendor/laravel/framework/src/Illuminate/Foundation/Http/Kernel.php:116
/home/vanmeeuwen/devel/src/apheleia/kolab.git/src/vendor/laravel/framework/src/Illuminate/Foundation/Testing/Concerns/MakesHttpRequests.php:375
/home/vanmeeuwen/devel/src/apheleia/kolab.git/src/vendor/laravel/framework/src/Illuminate/Foundation/Testing/Concerns/MakesHttpRequests.php:197
/home/vanmeeuwen/devel/src/apheleia/kolab.git/src/tests/Feature/Controller/SignupTest.php:505
10) Tests\Feature\Controller\SignupTest::testValidateEmail with data set #0 ('', 'validation.emailinvalid')
Illuminate\Database\QueryException: SQLSTATE[HY000]: General error: 1205 Lock wait timeout exceeded; try restarting transaction (SQL: delete from `users` where `email` = signuplogin@attorneymail.ch or `email` = SignupControllerTest1@attorneymail.ch or `email` = admin@external.com)
/home/vanmeeuwen/devel/src/apheleia/kolab.git/src/vendor/laravel/framework/src/Illuminate/Database/Connection.php:664
/home/vanmeeuwen/devel/src/apheleia/kolab.git/src/vendor/laravel/framework/src/Illuminate/Database/Connection.php:624
/home/vanmeeuwen/devel/src/apheleia/kolab.git/src/vendor/laravel/framework/src/Illuminate/Database/Connection.php:490
/home/vanmeeuwen/devel/src/apheleia/kolab.git/src/vendor/laravel/framework/src/Illuminate/Database/Connection.php:435
/home/vanmeeuwen/devel/src/apheleia/kolab.git/src/vendor/laravel/framework/src/Illuminate/Database/Query/Builder.php:2804
/home/vanmeeuwen/devel/src/apheleia/kolab.git/src/vendor/laravel/framework/src/Illuminate/Database/Eloquent/Builder.php:895
/home/vanmeeuwen/devel/src/apheleia/kolab.git/src/tests/Feature/Controller/SignupTest.php:39
Caused by
Doctrine\DBAL\Driver\PDOException: SQLSTATE[HY000]: General error: 1205 Lock wait timeout exceeded; try restarting transaction
/home/vanmeeuwen/devel/src/apheleia/kolab.git/src/vendor/doctrine/dbal/lib/Doctrine/DBAL/Driver/PDOStatement.php:123
/home/vanmeeuwen/devel/src/apheleia/kolab.git/src/vendor/laravel/framework/src/Illuminate/Database/Connection.php:483
/home/vanmeeuwen/devel/src/apheleia/kolab.git/src/vendor/laravel/framework/src/Illuminate/Database/Connection.php:657
/home/vanmeeuwen/devel/src/apheleia/kolab.git/src/vendor/laravel/framework/src/Illuminate/Database/Connection.php:624
/home/vanmeeuwen/devel/src/apheleia/kolab.git/src/vendor/laravel/framework/src/Illuminate/Database/Connection.php:490
/home/vanmeeuwen/devel/src/apheleia/kolab.git/src/vendor/laravel/framework/src/Illuminate/Database/Connection.php:435
/home/vanmeeuwen/devel/src/apheleia/kolab.git/src/vendor/laravel/framework/src/Illuminate/Database/Query/Builder.php:2804
/home/vanmeeuwen/devel/src/apheleia/kolab.git/src/vendor/laravel/framework/src/Illuminate/Database/Eloquent/Builder.php:895
/home/vanmeeuwen/devel/src/apheleia/kolab.git/src/tests/Feature/Controller/SignupTest.php:39
Caused by
PDOException: SQLSTATE[HY000]: General error: 1205 Lock wait timeout exceeded; try restarting transaction
/home/vanmeeuwen/devel/src/apheleia/kolab.git/src/vendor/doctrine/dbal/lib/Doctrine/DBAL/Driver/PDOStatement.php:121
/home/vanmeeuwen/devel/src/apheleia/kolab.git/src/vendor/laravel/framework/src/Illuminate/Database/Connection.php:483
/home/vanmeeuwen/devel/src/apheleia/kolab.git/src/vendor/laravel/framework/src/Illuminate/Database/Connection.php:657
/home/vanmeeuwen/devel/src/apheleia/kolab.git/src/vendor/laravel/framework/src/Illuminate/Database/Connection.php:624
/home/vanmeeuwen/devel/src/apheleia/kolab.git/src/vendor/laravel/framework/src/Illuminate/Database/Connection.php:490
/home/vanmeeuwen/devel/src/apheleia/kolab.git/src/vendor/laravel/framework/src/Illuminate/Database/Connection.php:435
/home/vanmeeuwen/devel/src/apheleia/kolab.git/src/vendor/laravel/framework/src/Illuminate/Database/Query/Builder.php:2804
/home/vanmeeuwen/devel/src/apheleia/kolab.git/src/vendor/laravel/framework/src/Illuminate/Database/Eloquent/Builder.php:895
/home/vanmeeuwen/devel/src/apheleia/kolab.git/src/tests/Feature/Controller/SignupTest.php:39
11) Tests\Feature\Controller\SignupTest::testValidateEmail with data set #1 ('example.org', 'validation.emailinvalid')
Illuminate\Database\QueryException: SQLSTATE[HY000]: General error: 1205 Lock wait timeout exceeded; try restarting transaction (SQL: delete from `users` where `email` = signuplogin@attorneymail.ch or `email` = SignupControllerTest1@attorneymail.ch or `email` = admin@external.com)
/home/vanmeeuwen/devel/src/apheleia/kolab.git/src/vendor/laravel/framework/src/Illuminate/Database/Connection.php:664
/home/vanmeeuwen/devel/src/apheleia/kolab.git/src/vendor/laravel/framework/src/Illuminate/Database/Connection.php:624
/home/vanmeeuwen/devel/src/apheleia/kolab.git/src/vendor/laravel/framework/src/Illuminate/Database/Connection.php:490
/home/vanmeeuwen/devel/src/apheleia/kolab.git/src/vendor/laravel/framework/src/Illuminate/Database/Connection.php:435
/home/vanmeeuwen/devel/src/apheleia/kolab.git/src/vendor/laravel/framework/src/Illuminate/Database/Query/Builder.php:2804
/home/vanmeeuwen/devel/src/apheleia/kolab.git/src/vendor/laravel/framework/src/Illuminate/Database/Eloquent/Builder.php:895
/home/vanmeeuwen/devel/src/apheleia/kolab.git/src/tests/Feature/Controller/SignupTest.php:39
Caused by
Doctrine\DBAL\Driver\PDOException: SQLSTATE[HY000]: General error: 1205 Lock wait timeout exceeded; try restarting transaction
/home/vanmeeuwen/devel/src/apheleia/kolab.git/src/vendor/doctrine/dbal/lib/Doctrine/DBAL/Driver/PDOStatement.php:123
/home/vanmeeuwen/devel/src/apheleia/kolab.git/src/vendor/laravel/framework/src/Illuminate/Database/Connection.php:483
/home/vanmeeuwen/devel/src/apheleia/kolab.git/src/vendor/laravel/framework/src/Illuminate/Database/Connection.php:657
/home/vanmeeuwen/devel/src/apheleia/kolab.git/src/vendor/laravel/framework/src/Illuminate/Database/Connection.php:624
/home/vanmeeuwen/devel/src/apheleia/kolab.git/src/vendor/laravel/framework/src/Illuminate/Database/Connection.php:490
/home/vanmeeuwen/devel/src/apheleia/kolab.git/src/vendor/laravel/framework/src/Illuminate/Database/Connection.php:435
/home/vanmeeuwen/devel/src/apheleia/kolab.git/src/vendor/laravel/framework/src/Illuminate/Database/Query/Builder.php:2804
/home/vanmeeuwen/devel/src/apheleia/kolab.git/src/vendor/laravel/framework/src/Illuminate/Database/Eloquent/Builder.php:895
/home/vanmeeuwen/devel/src/apheleia/kolab.git/src/tests/Feature/Controller/SignupTest.php:39
Caused by
PDOException: SQLSTATE[HY000]: General error: 1205 Lock wait timeout exceeded; try restarting transaction
/home/vanmeeuwen/devel/src/apheleia/kolab.git/src/vendor/doctrine/dbal/lib/Doctrine/DBAL/Driver/PDOStatement.php:121
/home/vanmeeuwen/devel/src/apheleia/kolab.git/src/vendor/laravel/framework/src/Illuminate/Database/Connection.php:483
/home/vanmeeuwen/devel/src/apheleia/kolab.git/src/vendor/laravel/framework/src/Illuminate/Database/Connection.php:657
/home/vanmeeuwen/devel/src/apheleia/kolab.git/src/vendor/laravel/framework/src/Illuminate/Database/Connection.php:624
/home/vanmeeuwen/devel/src/apheleia/kolab.git/src/vendor/laravel/framework/src/Illuminate/Database/Connection.php:490
/home/vanmeeuwen/devel/src/apheleia/kolab.git/src/vendor/laravel/framework/src/Illuminate/Database/Connection.php:435
/home/vanmeeuwen/devel/src/apheleia/kolab.git/src/vendor/laravel/framework/src/Illuminate/Database/Query/Builder.php:2804
/home/vanmeeuwen/devel/src/apheleia/kolab.git/src/vendor/laravel/framework/src/Illuminate/Database/Eloquent/Builder.php:895
/home/vanmeeuwen/devel/src/apheleia/kolab.git/src/tests/Feature/Controller/SignupTest.php:39
12) Tests\Feature\Controller\SignupTest::testValidateEmail with data set #2 ('@example.org', 'validation.emailinvalid')
Illuminate\Database\QueryException: SQLSTATE[HY000]: General error: 1205 Lock wait timeout exceeded; try restarting transaction (SQL: delete from `users` where `email` = signuplogin@attorneymail.ch or `email` = SignupControllerTest1@attorneymail.ch or `email` = admin@external.com)
/home/vanmeeuwen/devel/src/apheleia/kolab.git/src/vendor/laravel/framework/src/Illuminate/Database/Connection.php:664
/home/vanmeeuwen/devel/src/apheleia/kolab.git/src/vendor/laravel/framework/src/Illuminate/Database/Connection.php:624
/home/vanmeeuwen/devel/src/apheleia/kolab.git/src/vendor/laravel/framework/src/Illuminate/Database/Connection.php:490
/home/vanmeeuwen/devel/src/apheleia/kolab.git/src/vendor/laravel/framework/src/Illuminate/Database/Connection.php:435
/home/vanmeeuwen/devel/src/apheleia/kolab.git/src/vendor/laravel/framework/src/Illuminate/Database/Query/Builder.php:2804
/home/vanmeeuwen/devel/src/apheleia/kolab.git/src/vendor/laravel/framework/src/Illuminate/Database/Eloquent/Builder.php:895
/home/vanmeeuwen/devel/src/apheleia/kolab.git/src/tests/Feature/Controller/SignupTest.php:39
Caused by
Doctrine\DBAL\Driver\PDOException: SQLSTATE[HY000]: General error: 1205 Lock wait timeout exceeded; try restarting transaction
/home/vanmeeuwen/devel/src/apheleia/kolab.git/src/vendor/doctrine/dbal/lib/Doctrine/DBAL/Driver/PDOStatement.php:123
/home/vanmeeuwen/devel/src/apheleia/kolab.git/src/vendor/laravel/framework/src/Illuminate/Database/Connection.php:483
/home/vanmeeuwen/devel/src/apheleia/kolab.git/src/vendor/laravel/framework/src/Illuminate/Database/Connection.php:657
/home/vanmeeuwen/devel/src/apheleia/kolab.git/src/vendor/laravel/framework/src/Illuminate/Database/Connection.php:624
/home/vanmeeuwen/devel/src/apheleia/kolab.git/src/vendor/laravel/framework/src/Illuminate/Database/Connection.php:490
/home/vanmeeuwen/devel/src/apheleia/kolab.git/src/vendor/laravel/framework/src/Illuminate/Database/Connection.php:435
/home/vanmeeuwen/devel/src/apheleia/kolab.git/src/vendor/laravel/framework/src/Illuminate/Database/Query/Builder.php:2804
/home/vanmeeuwen/devel/src/apheleia/kolab.git/src/vendor/laravel/framework/src/Illuminate/Database/Eloquent/Builder.php:895
/home/vanmeeuwen/devel/src/apheleia/kolab.git/src/tests/Feature/Controller/SignupTest.php:39
Caused by
PDOException: SQLSTATE[HY000]: General error: 1205 Lock wait timeout exceeded; try restarting transaction
/home/vanmeeuwen/devel/src/apheleia/kolab.git/src/vendor/doctrine/dbal/lib/Doctrine/DBAL/Driver/PDOStatement.php:121
/home/vanmeeuwen/devel/src/apheleia/kolab.git/src/vendor/laravel/framework/src/Illuminate/Database/Connection.php:483
/home/vanmeeuwen/devel/src/apheleia/kolab.git/src/vendor/laravel/framework/src/Illuminate/Database/Connection.php:657
/home/vanmeeuwen/devel/src/apheleia/kolab.git/src/vendor/laravel/framework/src/Illuminate/Database/Connection.php:624
/home/vanmeeuwen/devel/src/apheleia/kolab.git/src/vendor/laravel/framework/src/Illuminate/Database/Connection.php:490
/home/vanmeeuwen/devel/src/apheleia/kolab.git/src/vendor/laravel/framework/src/Illuminate/Database/Connection.php:435
/home/vanmeeuwen/devel/src/apheleia/kolab.git/src/vendor/laravel/framework/src/Illuminate/Database/Query/Builder.php:2804
/home/vanmeeuwen/devel/src/apheleia/kolab.git/src/vendor/laravel/framework/src/Illuminate/Database/Eloquent/Builder.php:895
/home/vanmeeuwen/devel/src/apheleia/kolab.git/src/tests/Feature/Controller/SignupTest.php:39
13) Tests\Feature\Controller\SignupTest::testValidateEmail with data set #3 ('test@localhost', 'validation.emailinvalid')
Illuminate\Database\QueryException: SQLSTATE[HY000]: General error: 1205 Lock wait timeout exceeded; try restarting transaction (SQL: delete from `users` where `email` = signuplogin@attorneymail.ch or `email` = SignupControllerTest1@attorneymail.ch or `email` = admin@external.com)
/home/vanmeeuwen/devel/src/apheleia/kolab.git/src/vendor/laravel/framework/src/Illuminate/Database/Connection.php:664
/home/vanmeeuwen/devel/src/apheleia/kolab.git/src/vendor/laravel/framework/src/Illuminate/Database/Connection.php:624
/home/vanmeeuwen/devel/src/apheleia/kolab.git/src/vendor/laravel/framework/src/Illuminate/Database/Connection.php:490
/home/vanmeeuwen/devel/src/apheleia/kolab.git/src/vendor/laravel/framework/src/Illuminate/Database/Connection.php:435
/home/vanmeeuwen/devel/src/apheleia/kolab.git/src/vendor/laravel/framework/src/Illuminate/Database/Query/Builder.php:2804
/home/vanmeeuwen/devel/src/apheleia/kolab.git/src/vendor/laravel/framework/src/Illuminate/Database/Eloquent/Builder.php:895
/home/vanmeeuwen/devel/src/apheleia/kolab.git/src/tests/Feature/Controller/SignupTest.php:39
Caused by
Doctrine\DBAL\Driver\PDOException: SQLSTATE[HY000]: General error: 1205 Lock wait timeout exceeded; try restarting transaction
/home/vanmeeuwen/devel/src/apheleia/kolab.git/src/vendor/doctrine/dbal/lib/Doctrine/DBAL/Driver/PDOStatement.php:123
/home/vanmeeuwen/devel/src/apheleia/kolab.git/src/vendor/laravel/framework/src/Illuminate/Database/Connection.php:483
/home/vanmeeuwen/devel/src/apheleia/kolab.git/src/vendor/laravel/framework/src/Illuminate/Database/Connection.php:657
/home/vanmeeuwen/devel/src/apheleia/kolab.git/src/vendor/laravel/framework/src/Illuminate/Database/Connection.php:624
/home/vanmeeuwen/devel/src/apheleia/kolab.git/src/vendor/laravel/framework/src/Illuminate/Database/Connection.php:490
/home/vanmeeuwen/devel/src/apheleia/kolab.git/src/vendor/laravel/framework/src/Illuminate/Database/Connection.php:435
/home/vanmeeuwen/devel/src/apheleia/kolab.git/src/vendor/laravel/framework/src/Illuminate/Database/Query/Builder.php:2804
/home/vanmeeuwen/devel/src/apheleia/kolab.git/src/vendor/laravel/framework/src/Illuminate/Database/Eloquent/Builder.php:895
/home/vanmeeuwen/devel/src/apheleia/kolab.git/src/tests/Feature/Controller/SignupTest.php:39
Caused by
PDOException: SQLSTATE[HY000]: General error: 1205 Lock wait timeout exceeded; try restarting transaction
/home/vanmeeuwen/devel/src/apheleia/kolab.git/src/vendor/doctrine/dbal/lib/Doctrine/DBAL/Driver/PDOStatement.php:121
/home/vanmeeuwen/devel/src/apheleia/kolab.git/src/vendor/laravel/framework/src/Illuminate/Database/Connection.php:483
/home/vanmeeuwen/devel/src/apheleia/kolab.git/src/vendor/laravel/framework/src/Illuminate/Database/Connection.php:657
/home/vanmeeuwen/devel/src/apheleia/kolab.git/src/vendor/laravel/framework/src/Illuminate/Database/Connection.php:624
/home/vanmeeuwen/devel/src/apheleia/kolab.git/src/vendor/laravel/framework/src/Illuminate/Database/Connection.php:490
/home/vanmeeuwen/devel/src/apheleia/kolab.git/src/vendor/laravel/framework/src/Illuminate/Database/Connection.php:435
/home/vanmeeuwen/devel/src/apheleia/kolab.git/src/vendor/laravel/framework/src/Illuminate/Database/Query/Builder.php:2804
/home/vanmeeuwen/devel/src/apheleia/kolab.git/src/vendor/laravel/framework/src/Illuminate/Database/Eloquent/Builder.php:895
/home/vanmeeuwen/devel/src/apheleia/kolab.git/src/tests/Feature/Controller/SignupTest.php:39
14) Tests\Feature\Controller\SignupTest::testValidateEmail with data set #4 ('test@domain.tld', null)
Illuminate\Database\QueryException: SQLSTATE[HY000]: General error: 1205 Lock wait timeout exceeded; try restarting transaction (SQL: delete from `users` where `email` = signuplogin@attorneymail.ch or `email` = SignupControllerTest1@attorneymail.ch or `email` = admin@external.com)
/home/vanmeeuwen/devel/src/apheleia/kolab.git/src/vendor/laravel/framework/src/Illuminate/Database/Connection.php:664
/home/vanmeeuwen/devel/src/apheleia/kolab.git/src/vendor/laravel/framework/src/Illuminate/Database/Connection.php:624
/home/vanmeeuwen/devel/src/apheleia/kolab.git/src/vendor/laravel/framework/src/Illuminate/Database/Connection.php:490
/home/vanmeeuwen/devel/src/apheleia/kolab.git/src/vendor/laravel/framework/src/Illuminate/Database/Connection.php:435
/home/vanmeeuwen/devel/src/apheleia/kolab.git/src/vendor/laravel/framework/src/Illuminate/Database/Query/Builder.php:2804
/home/vanmeeuwen/devel/src/apheleia/kolab.git/src/vendor/laravel/framework/src/Illuminate/Database/Eloquent/Builder.php:895
/home/vanmeeuwen/devel/src/apheleia/kolab.git/src/tests/Feature/Controller/SignupTest.php:39
Caused by
Doctrine\DBAL\Driver\PDOException: SQLSTATE[HY000]: General error: 1205 Lock wait timeout exceeded; try restarting transaction
/home/vanmeeuwen/devel/src/apheleia/kolab.git/src/vendor/doctrine/dbal/lib/Doctrine/DBAL/Driver/PDOStatement.php:123
/home/vanmeeuwen/devel/src/apheleia/kolab.git/src/vendor/laravel/framework/src/Illuminate/Database/Connection.php:483
/home/vanmeeuwen/devel/src/apheleia/kolab.git/src/vendor/laravel/framework/src/Illuminate/Database/Connection.php:657
/home/vanmeeuwen/devel/src/apheleia/kolab.git/src/vendor/laravel/framework/src/Illuminate/Database/Connection.php:624
/home/vanmeeuwen/devel/src/apheleia/kolab.git/src/vendor/laravel/framework/src/Illuminate/Database/Connection.php:490
/home/vanmeeuwen/devel/src/apheleia/kolab.git/src/vendor/laravel/framework/src/Illuminate/Database/Connection.php:435
/home/vanmeeuwen/devel/src/apheleia/kolab.git/src/vendor/laravel/framework/src/Illuminate/Database/Query/Builder.php:2804
/home/vanmeeuwen/devel/src/apheleia/kolab.git/src/vendor/laravel/framework/src/Illuminate/Database/Eloquent/Builder.php:895
/home/vanmeeuwen/devel/src/apheleia/kolab.git/src/tests/Feature/Controller/SignupTest.php:39
Caused by
PDOException: SQLSTATE[HY000]: General error: 1205 Lock wait timeout exceeded; try restarting transaction
/home/vanmeeuwen/devel/src/apheleia/kolab.git/src/vendor/doctrine/dbal/lib/Doctrine/DBAL/Driver/PDOStatement.php:121
/home/vanmeeuwen/devel/src/apheleia/kolab.git/src/vendor/laravel/framework/src/Illuminate/Database/Connection.php:483
/home/vanmeeuwen/devel/src/apheleia/kolab.git/src/vendor/laravel/framework/src/Illuminate/Database/Connection.php:657
/home/vanmeeuwen/devel/src/apheleia/kolab.git/src/vendor/laravel/framework/src/Illuminate/Database/Connection.php:624
/home/vanmeeuwen/devel/src/apheleia/kolab.git/src/vendor/laravel/framework/src/Illuminate/Database/Connection.php:490
/home/vanmeeuwen/devel/src/apheleia/kolab.git/src/vendor/laravel/framework/src/Illuminate/Database/Connection.php:435
/home/vanmeeuwen/devel/src/apheleia/kolab.git/src/vendor/laravel/framework/src/Illuminate/Database/Query/Builder.php:2804
/home/vanmeeuwen/devel/src/apheleia/kolab.git/src/vendor/laravel/framework/src/Illuminate/Database/Eloquent/Builder.php:895
/home/vanmeeuwen/devel/src/apheleia/kolab.git/src/tests/Feature/Controller/SignupTest.php:39
15) Tests\Feature\Controller\SignupTest::testValidateEmail with data set #5 ('&@example.org', null)
Illuminate\Database\QueryException: SQLSTATE[HY000]: General error: 1205 Lock wait timeout exceeded; try restarting transaction (SQL: delete from `users` where `email` = signuplogin@attorneymail.ch or `email` = SignupControllerTest1@attorneymail.ch or `email` = admin@external.com)
/home/vanmeeuwen/devel/src/apheleia/kolab.git/src/vendor/laravel/framework/src/Illuminate/Database/Connection.php:664
/home/vanmeeuwen/devel/src/apheleia/kolab.git/src/vendor/laravel/framework/src/Illuminate/Database/Connection.php:624
/home/vanmeeuwen/devel/src/apheleia/kolab.git/src/vendor/laravel/framework/src/Illuminate/Database/Connection.php:490
/home/vanmeeuwen/devel/src/apheleia/kolab.git/src/vendor/laravel/framework/src/Illuminate/Database/Connection.php:435
/home/vanmeeuwen/devel/src/apheleia/kolab.git/src/vendor/laravel/framework/src/Illuminate/Database/Query/Builder.php:2804
/home/vanmeeuwen/devel/src/apheleia/kolab.git/src/vendor/laravel/framework/src/Illuminate/Database/Eloquent/Builder.php:895
/home/vanmeeuwen/devel/src/apheleia/kolab.git/src/tests/Feature/Controller/SignupTest.php:39
Caused by
Doctrine\DBAL\Driver\PDOException: SQLSTATE[HY000]: General error: 1205 Lock wait timeout exceeded; try restarting transaction
/home/vanmeeuwen/devel/src/apheleia/kolab.git/src/vendor/doctrine/dbal/lib/Doctrine/DBAL/Driver/PDOStatement.php:123
/home/vanmeeuwen/devel/src/apheleia/kolab.git/src/vendor/laravel/framework/src/Illuminate/Database/Connection.php:483
/home/vanmeeuwen/devel/src/apheleia/kolab.git/src/vendor/laravel/framework/src/Illuminate/Database/Connection.php:657
/home/vanmeeuwen/devel/src/apheleia/kolab.git/src/vendor/laravel/framework/src/Illuminate/Database/Connection.php:624
/home/vanmeeuwen/devel/src/apheleia/kolab.git/src/vendor/laravel/framework/src/Illuminate/Database/Connection.php:490
/home/vanmeeuwen/devel/src/apheleia/kolab.git/src/vendor/laravel/framework/src/Illuminate/Database/Connection.php:435
/home/vanmeeuwen/devel/src/apheleia/kolab.git/src/vendor/laravel/framework/src/Illuminate/Database/Query/Builder.php:2804
/home/vanmeeuwen/devel/src/apheleia/kolab.git/src/vendor/laravel/framework/src/Illuminate/Database/Eloquent/Builder.php:895
/home/vanmeeuwen/devel/src/apheleia/kolab.git/src/tests/Feature/Controller/SignupTest.php:39
Caused by
PDOException: SQLSTATE[HY000]: General error: 1205 Lock wait timeout exceeded; try restarting transaction
/home/vanmeeuwen/devel/src/apheleia/kolab.git/src/vendor/doctrine/dbal/lib/Doctrine/DBAL/Driver/PDOStatement.php:121
/home/vanmeeuwen/devel/src/apheleia/kolab.git/src/vendor/laravel/framework/src/Illuminate/Database/Connection.php:483
/home/vanmeeuwen/devel/src/apheleia/kolab.git/src/vendor/laravel/framework/src/Illuminate/Database/Connection.php:657
/home/vanmeeuwen/devel/src/apheleia/kolab.git/src/vendor/laravel/framework/src/Illuminate/Database/Connection.php:624
/home/vanmeeuwen/devel/src/apheleia/kolab.git/src/vendor/laravel/framework/src/Illuminate/Database/Connection.php:490
/home/vanmeeuwen/devel/src/apheleia/kolab.git/src/vendor/laravel/framework/src/Illuminate/Database/Connection.php:435
/home/vanmeeuwen/devel/src/apheleia/kolab.git/src/vendor/laravel/framework/src/Illuminate/Database/Query/Builder.php:2804
/home/vanmeeuwen/devel/src/apheleia/kolab.git/src/vendor/laravel/framework/src/Illuminate/Database/Eloquent/Builder.php:895
/home/vanmeeuwen/devel/src/apheleia/kolab.git/src/tests/Feature/Controller/SignupTest.php:39
16) Tests\Feature\Controller\SignupTest::testValidateLogin with data set #0 ('', 'attorneymail.ch', false, array('validation.logininvalid'))
Illuminate\Database\QueryException: SQLSTATE[HY000]: General error: 1205 Lock wait timeout exceeded; try restarting transaction (SQL: delete from `users` where `email` = signuplogin@attorneymail.ch or `email` = SignupControllerTest1@attorneymail.ch or `email` = admin@external.com)
/home/vanmeeuwen/devel/src/apheleia/kolab.git/src/vendor/laravel/framework/src/Illuminate/Database/Connection.php:664
/home/vanmeeuwen/devel/src/apheleia/kolab.git/src/vendor/laravel/framework/src/Illuminate/Database/Connection.php:624
/home/vanmeeuwen/devel/src/apheleia/kolab.git/src/vendor/laravel/framework/src/Illuminate/Database/Connection.php:490
/home/vanmeeuwen/devel/src/apheleia/kolab.git/src/vendor/laravel/framework/src/Illuminate/Database/Connection.php:435
/home/vanmeeuwen/devel/src/apheleia/kolab.git/src/vendor/laravel/framework/src/Illuminate/Database/Query/Builder.php:2804
/home/vanmeeuwen/devel/src/apheleia/kolab.git/src/vendor/laravel/framework/src/Illuminate/Database/Eloquent/Builder.php:895
/home/vanmeeuwen/devel/src/apheleia/kolab.git/src/tests/Feature/Controller/SignupTest.php:39
Caused by
Doctrine\DBAL\Driver\PDOException: SQLSTATE[HY000]: General error: 1205 Lock wait timeout exceeded; try restarting transaction
/home/vanmeeuwen/devel/src/apheleia/kolab.git/src/vendor/doctrine/dbal/lib/Doctrine/DBAL/Driver/PDOStatement.php:123
/home/vanmeeuwen/devel/src/apheleia/kolab.git/src/vendor/laravel/framework/src/Illuminate/Database/Connection.php:483
/home/vanmeeuwen/devel/src/apheleia/kolab.git/src/vendor/laravel/framework/src/Illuminate/Database/Connection.php:657
/home/vanmeeuwen/devel/src/apheleia/kolab.git/src/vendor/laravel/framework/src/Illuminate/Database/Connection.php:624
/home/vanmeeuwen/devel/src/apheleia/kolab.git/src/vendor/laravel/framework/src/Illuminate/Database/Connection.php:490
/home/vanmeeuwen/devel/src/apheleia/kolab.git/src/vendor/laravel/framework/src/Illuminate/Database/Connection.php:435
/home/vanmeeuwen/devel/src/apheleia/kolab.git/src/vendor/laravel/framework/src/Illuminate/Database/Query/Builder.php:2804
/home/vanmeeuwen/devel/src/apheleia/kolab.git/src/vendor/laravel/framework/src/Illuminate/Database/Eloquent/Builder.php:895
/home/vanmeeuwen/devel/src/apheleia/kolab.git/src/tests/Feature/Controller/SignupTest.php:39
Caused by
PDOException: SQLSTATE[HY000]: General error: 1205 Lock wait timeout exceeded; try restarting transaction
/home/vanmeeuwen/devel/src/apheleia/kolab.git/src/vendor/doctrine/dbal/lib/Doctrine/DBAL/Driver/PDOStatement.php:121
/home/vanmeeuwen/devel/src/apheleia/kolab.git/src/vendor/laravel/framework/src/Illuminate/Database/Connection.php:483
/home/vanmeeuwen/devel/src/apheleia/kolab.git/src/vendor/laravel/framework/src/Illuminate/Database/Connection.php:657
/home/vanmeeuwen/devel/src/apheleia/kolab.git/src/vendor/laravel/framework/src/Illuminate/Database/Connection.php:624
/home/vanmeeuwen/devel/src/apheleia/kolab.git/src/vendor/laravel/framework/src/Illuminate/Database/Connection.php:490
/home/vanmeeuwen/devel/src/apheleia/kolab.git/src/vendor/laravel/framework/src/Illuminate/Database/Connection.php:435
/home/vanmeeuwen/devel/src/apheleia/kolab.git/src/vendor/laravel/framework/src/Illuminate/Database/Query/Builder.php:2804
/home/vanmeeuwen/devel/src/apheleia/kolab.git/src/vendor/laravel/framework/src/Illuminate/Database/Eloquent/Builder.php:895
/home/vanmeeuwen/devel/src/apheleia/kolab.git/src/tests/Feature/Controller/SignupTest.php:39
17) Tests\Feature\Controller\SignupTest::testValidateLogin with data set #1 ('test123456', 'localhost', false, array('validation.domaininvalid'))
Illuminate\Database\QueryException: SQLSTATE[HY000]: General error: 1205 Lock wait timeout exceeded; try restarting transaction (SQL: delete from `users` where `email` = signuplogin@attorneymail.ch or `email` = SignupControllerTest1@attorneymail.ch or `email` = admin@external.com)
/home/vanmeeuwen/devel/src/apheleia/kolab.git/src/vendor/laravel/framework/src/Illuminate/Database/Connection.php:664
/home/vanmeeuwen/devel/src/apheleia/kolab.git/src/vendor/laravel/framework/src/Illuminate/Database/Connection.php:624
/home/vanmeeuwen/devel/src/apheleia/kolab.git/src/vendor/laravel/framework/src/Illuminate/Database/Connection.php:490
/home/vanmeeuwen/devel/src/apheleia/kolab.git/src/vendor/laravel/framework/src/Illuminate/Database/Connection.php:435
/home/vanmeeuwen/devel/src/apheleia/kolab.git/src/vendor/laravel/framework/src/Illuminate/Database/Query/Builder.php:2804
/home/vanmeeuwen/devel/src/apheleia/kolab.git/src/vendor/laravel/framework/src/Illuminate/Database/Eloquent/Builder.php:895
/home/vanmeeuwen/devel/src/apheleia/kolab.git/src/tests/Feature/Controller/SignupTest.php:39
Caused by
Doctrine\DBAL\Driver\PDOException: SQLSTATE[HY000]: General error: 1205 Lock wait timeout exceeded; try restarting transaction
/home/vanmeeuwen/devel/src/apheleia/kolab.git/src/vendor/doctrine/dbal/lib/Doctrine/DBAL/Driver/PDOStatement.php:123
/home/vanmeeuwen/devel/src/apheleia/kolab.git/src/vendor/laravel/framework/src/Illuminate/Database/Connection.php:483
/home/vanmeeuwen/devel/src/apheleia/kolab.git/src/vendor/laravel/framework/src/Illuminate/Database/Connection.php:657
/home/vanmeeuwen/devel/src/apheleia/kolab.git/src/vendor/laravel/framework/src/Illuminate/Database/Connection.php:624
/home/vanmeeuwen/devel/src/apheleia/kolab.git/src/vendor/laravel/framework/src/Illuminate/Database/Connection.php:490
/home/vanmeeuwen/devel/src/apheleia/kolab.git/src/vendor/laravel/framework/src/Illuminate/Database/Connection.php:435
/home/vanmeeuwen/devel/src/apheleia/kolab.git/src/vendor/laravel/framework/src/Illuminate/Database/Query/Builder.php:2804
/home/vanmeeuwen/devel/src/apheleia/kolab.git/src/vendor/laravel/framework/src/Illuminate/Database/Eloquent/Builder.php:895
/home/vanmeeuwen/devel/src/apheleia/kolab.git/src/tests/Feature/Controller/SignupTest.php:39
Caused by
PDOException: SQLSTATE[HY000]: General error: 1205 Lock wait timeout exceeded; try restarting transaction
/home/vanmeeuwen/devel/src/apheleia/kolab.git/src/vendor/doctrine/dbal/lib/Doctrine/DBAL/Driver/PDOStatement.php:121
/home/vanmeeuwen/devel/src/apheleia/kolab.git/src/vendor/laravel/framework/src/Illuminate/Database/Connection.php:483
/home/vanmeeuwen/devel/src/apheleia/kolab.git/src/vendor/laravel/framework/src/Illuminate/Database/Connection.php:657
/home/vanmeeuwen/devel/src/apheleia/kolab.git/src/vendor/laravel/framework/src/Illuminate/Database/Connection.php:624
/home/vanmeeuwen/devel/src/apheleia/kolab.git/src/vendor/laravel/framework/src/Illuminate/Database/Connection.php:490
/home/vanmeeuwen/devel/src/apheleia/kolab.git/src/vendor/laravel/framework/src/Illuminate/Database/Connection.php:435
/home/vanmeeuwen/devel/src/apheleia/kolab.git/src/vendor/laravel/framework/src/Illuminate/Database/Query/Builder.php:2804
/home/vanmeeuwen/devel/src/apheleia/kolab.git/src/vendor/laravel/framework/src/Illuminate/Database/Eloquent/Builder.php:895
/home/vanmeeuwen/devel/src/apheleia/kolab.git/src/tests/Feature/Controller/SignupTest.php:39
18) Tests\Feature\Controller\SignupTest::testValidateLogin with data set #2 ('test123456', 'unknown-domain.org', false, array('validation.domaininvalid'))
Illuminate\Database\QueryException: SQLSTATE[HY000]: General error: 1205 Lock wait timeout exceeded; try restarting transaction (SQL: delete from `users` where `email` = signuplogin@attorneymail.ch or `email` = SignupControllerTest1@attorneymail.ch or `email` = admin@external.com)
/home/vanmeeuwen/devel/src/apheleia/kolab.git/src/vendor/laravel/framework/src/Illuminate/Database/Connection.php:664
/home/vanmeeuwen/devel/src/apheleia/kolab.git/src/vendor/laravel/framework/src/Illuminate/Database/Connection.php:624
/home/vanmeeuwen/devel/src/apheleia/kolab.git/src/vendor/laravel/framework/src/Illuminate/Database/Connection.php:490
/home/vanmeeuwen/devel/src/apheleia/kolab.git/src/vendor/laravel/framework/src/Illuminate/Database/Connection.php:435
/home/vanmeeuwen/devel/src/apheleia/kolab.git/src/vendor/laravel/framework/src/Illuminate/Database/Query/Builder.php:2804
/home/vanmeeuwen/devel/src/apheleia/kolab.git/src/vendor/laravel/framework/src/Illuminate/Database/Eloquent/Builder.php:895
/home/vanmeeuwen/devel/src/apheleia/kolab.git/src/tests/Feature/Controller/SignupTest.php:39
Caused by
Doctrine\DBAL\Driver\PDOException: SQLSTATE[HY000]: General error: 1205 Lock wait timeout exceeded; try restarting transaction
/home/vanmeeuwen/devel/src/apheleia/kolab.git/src/vendor/doctrine/dbal/lib/Doctrine/DBAL/Driver/PDOStatement.php:123
/home/vanmeeuwen/devel/src/apheleia/kolab.git/src/vendor/laravel/framework/src/Illuminate/Database/Connection.php:483
/home/vanmeeuwen/devel/src/apheleia/kolab.git/src/vendor/laravel/framework/src/Illuminate/Database/Connection.php:657
/home/vanmeeuwen/devel/src/apheleia/kolab.git/src/vendor/laravel/framework/src/Illuminate/Database/Connection.php:624
/home/vanmeeuwen/devel/src/apheleia/kolab.git/src/vendor/laravel/framework/src/Illuminate/Database/Connection.php:490
/home/vanmeeuwen/devel/src/apheleia/kolab.git/src/vendor/laravel/framework/src/Illuminate/Database/Connection.php:435
/home/vanmeeuwen/devel/src/apheleia/kolab.git/src/vendor/laravel/framework/src/Illuminate/Database/Query/Builder.php:2804
/home/vanmeeuwen/devel/src/apheleia/kolab.git/src/vendor/laravel/framework/src/Illuminate/Database/Eloquent/Builder.php:895
/home/vanmeeuwen/devel/src/apheleia/kolab.git/src/tests/Feature/Controller/SignupTest.php:39
Caused by
PDOException: SQLSTATE[HY000]: General error: 1205 Lock wait timeout exceeded; try restarting transaction
/home/vanmeeuwen/devel/src/apheleia/kolab.git/src/vendor/doctrine/dbal/lib/Doctrine/DBAL/Driver/PDOStatement.php:121
/home/vanmeeuwen/devel/src/apheleia/kolab.git/src/vendor/laravel/framework/src/Illuminate/Database/Connection.php:483
/home/vanmeeuwen/devel/src/apheleia/kolab.git/src/vendor/laravel/framework/src/Illuminate/Database/Connection.php:657
/home/vanmeeuwen/devel/src/apheleia/kolab.git/src/vendor/laravel/framework/src/Illuminate/Database/Connection.php:624
/home/vanmeeuwen/devel/src/apheleia/kolab.git/src/vendor/laravel/framework/src/Illuminate/Database/Connection.php:490
/home/vanmeeuwen/devel/src/apheleia/kolab.git/src/vendor/laravel/framework/src/Illuminate/Database/Connection.php:435
/home/vanmeeuwen/devel/src/apheleia/kolab.git/src/vendor/laravel/framework/src/Illuminate/Database/Query/Builder.php:2804
/home/vanmeeuwen/devel/src/apheleia/kolab.git/src/vendor/laravel/framework/src/Illuminate/Database/Eloquent/Builder.php:895
/home/vanmeeuwen/devel/src/apheleia/kolab.git/src/tests/Feature/Controller/SignupTest.php:39
19) Tests\Feature\EntitlementTest::testUserAddEntitlement
Illuminate\Database\QueryException: SQLSTATE[HY000]: General error: 1205 Lock wait timeout exceeded; try restarting transaction (SQL: insert into `users` (`email`, `id`, `status`, `updated_at`, `created_at`) values (entitled-user@custom-domain.com, 1722054749, 1, 2020-02-10 08:36:19, 2020-02-10 08:36:19))
/home/vanmeeuwen/devel/src/apheleia/kolab.git/src/vendor/laravel/framework/src/Illuminate/Database/Connection.php:664
/home/vanmeeuwen/devel/src/apheleia/kolab.git/src/vendor/laravel/framework/src/Illuminate/Database/Connection.php:624
/home/vanmeeuwen/devel/src/apheleia/kolab.git/src/vendor/laravel/framework/src/Illuminate/Database/Connection.php:459
/home/vanmeeuwen/devel/src/apheleia/kolab.git/src/vendor/laravel/framework/src/Illuminate/Database/Connection.php:411
/home/vanmeeuwen/devel/src/apheleia/kolab.git/src/vendor/laravel/framework/src/Illuminate/Database/Query/Builder.php:2646
/home/vanmeeuwen/devel/src/apheleia/kolab.git/src/vendor/laravel/framework/src/Illuminate/Database/Eloquent/Builder.php:1353
/home/vanmeeuwen/devel/src/apheleia/kolab.git/src/vendor/laravel/framework/src/Illuminate/Database/Eloquent/Model.php:815
/home/vanmeeuwen/devel/src/apheleia/kolab.git/src/vendor/laravel/framework/src/Illuminate/Database/Eloquent/Model.php:667
/home/vanmeeuwen/devel/src/apheleia/kolab.git/src/vendor/laravel/framework/src/Illuminate/Database/Eloquent/Builder.php:422
/home/vanmeeuwen/devel/src/apheleia/kolab.git/src/vendor/laravel/framework/src/Illuminate/Support/helpers.php:1124
/home/vanmeeuwen/devel/src/apheleia/kolab.git/src/vendor/laravel/framework/src/Illuminate/Database/Eloquent/Builder.php:423
/home/vanmeeuwen/devel/src/apheleia/kolab.git/src/vendor/laravel/framework/src/Illuminate/Support/Traits/ForwardsCalls.php:23
/home/vanmeeuwen/devel/src/apheleia/kolab.git/src/vendor/laravel/framework/src/Illuminate/Database/Eloquent/Model.php:1618
/home/vanmeeuwen/devel/src/apheleia/kolab.git/src/vendor/laravel/framework/src/Illuminate/Database/Eloquent/Model.php:1630
/home/vanmeeuwen/devel/src/apheleia/kolab.git/src/tests/TestCase.php:33
/home/vanmeeuwen/devel/src/apheleia/kolab.git/src/tests/Feature/EntitlementTest.php:31
Caused by
Doctrine\DBAL\Driver\PDOException: SQLSTATE[HY000]: General error: 1205 Lock wait timeout exceeded; try restarting transaction
/home/vanmeeuwen/devel/src/apheleia/kolab.git/src/vendor/doctrine/dbal/lib/Doctrine/DBAL/Driver/PDOStatement.php:123
/home/vanmeeuwen/devel/src/apheleia/kolab.git/src/vendor/laravel/framework/src/Illuminate/Database/Connection.php:458
/home/vanmeeuwen/devel/src/apheleia/kolab.git/src/vendor/laravel/framework/src/Illuminate/Database/Connection.php:657
/home/vanmeeuwen/devel/src/apheleia/kolab.git/src/vendor/laravel/framework/src/Illuminate/Database/Connection.php:624
/home/vanmeeuwen/devel/src/apheleia/kolab.git/src/vendor/laravel/framework/src/Illuminate/Database/Connection.php:459
/home/vanmeeuwen/devel/src/apheleia/kolab.git/src/vendor/laravel/framework/src/Illuminate/Database/Connection.php:411
/home/vanmeeuwen/devel/src/apheleia/kolab.git/src/vendor/laravel/framework/src/Illuminate/Database/Query/Builder.php:2646
/home/vanmeeuwen/devel/src/apheleia/kolab.git/src/vendor/laravel/framework/src/Illuminate/Database/Eloquent/Builder.php:1353
/home/vanmeeuwen/devel/src/apheleia/kolab.git/src/vendor/laravel/framework/src/Illuminate/Database/Eloquent/Model.php:815
/home/vanmeeuwen/devel/src/apheleia/kolab.git/src/vendor/laravel/framework/src/Illuminate/Database/Eloquent/Model.php:667
/home/vanmeeuwen/devel/src/apheleia/kolab.git/src/vendor/laravel/framework/src/Illuminate/Database/Eloquent/Builder.php:422
/home/vanmeeuwen/devel/src/apheleia/kolab.git/src/vendor/laravel/framework/src/Illuminate/Support/helpers.php:1124
/home/vanmeeuwen/devel/src/apheleia/kolab.git/src/vendor/laravel/framework/src/Illuminate/Database/Eloquent/Builder.php:423
/home/vanmeeuwen/devel/src/apheleia/kolab.git/src/vendor/laravel/framework/src/Illuminate/Support/Traits/ForwardsCalls.php:23
/home/vanmeeuwen/devel/src/apheleia/kolab.git/src/vendor/laravel/framework/src/Illuminate/Database/Eloquent/Model.php:1618
/home/vanmeeuwen/devel/src/apheleia/kolab.git/src/vendor/laravel/framework/src/Illuminate/Database/Eloquent/Model.php:1630
/home/vanmeeuwen/devel/src/apheleia/kolab.git/src/tests/TestCase.php:33
/home/vanmeeuwen/devel/src/apheleia/kolab.git/src/tests/Feature/EntitlementTest.php:31
Caused by
PDOException: SQLSTATE[HY000]: General error: 1205 Lock wait timeout exceeded; try restarting transaction
/home/vanmeeuwen/devel/src/apheleia/kolab.git/src/vendor/doctrine/dbal/lib/Doctrine/DBAL/Driver/PDOStatement.php:121
/home/vanmeeuwen/devel/src/apheleia/kolab.git/src/vendor/laravel/framework/src/Illuminate/Database/Connection.php:458
/home/vanmeeuwen/devel/src/apheleia/kolab.git/src/vendor/laravel/framework/src/Illuminate/Database/Connection.php:657
/home/vanmeeuwen/devel/src/apheleia/kolab.git/src/vendor/laravel/framework/src/Illuminate/Database/Connection.php:624
/home/vanmeeuwen/devel/src/apheleia/kolab.git/src/vendor/laravel/framework/src/Illuminate/Database/Connection.php:459
/home/vanmeeuwen/devel/src/apheleia/kolab.git/src/vendor/laravel/framework/src/Illuminate/Database/Connection.php:411
/home/vanmeeuwen/devel/src/apheleia/kolab.git/src/vendor/laravel/framework/src/Illuminate/Database/Query/Builder.php:2646
/home/vanmeeuwen/devel/src/apheleia/kolab.git/src/vendor/laravel/framework/src/Illuminate/Database/Eloquent/Builder.php:1353
/home/vanmeeuwen/devel/src/apheleia/kolab.git/src/vendor/laravel/framework/src/Illuminate/Database/Eloquent/Model.php:815
/home/vanmeeuwen/devel/src/apheleia/kolab.git/src/vendor/laravel/framework/src/Illuminate/Database/Eloquent/Model.php:667
/home/vanmeeuwen/devel/src/apheleia/kolab.git/src/vendor/laravel/framework/src/Illuminate/Database/Eloquent/Builder.php:422
/home/vanmeeuwen/devel/src/apheleia/kolab.git/src/vendor/laravel/framework/src/Illuminate/Support/helpers.php:1124
/home/vanmeeuwen/devel/src/apheleia/kolab.git/src/vendor/laravel/framework/src/Illuminate/Database/Eloquent/Builder.php:423
/home/vanmeeuwen/devel/src/apheleia/kolab.git/src/vendor/laravel/framework/src/Illuminate/Support/Traits/ForwardsCalls.php:23
/home/vanmeeuwen/devel/src/apheleia/kolab.git/src/vendor/laravel/framework/src/Illuminate/Database/Eloquent/Model.php:1618
/home/vanmeeuwen/devel/src/apheleia/kolab.git/src/vendor/laravel/framework/src/Illuminate/Database/Eloquent/Model.php:1630
/home/vanmeeuwen/devel/src/apheleia/kolab.git/src/tests/TestCase.php:33
/home/vanmeeuwen/devel/src/apheleia/kolab.git/src/tests/Feature/EntitlementTest.php:31
20) Tests\Feature\Jobs\DomainCreateTest::testHandle
Mockery\Exception\RuntimeException: Could not load mock App\Backends\LDAP, class already exists
/home/vanmeeuwen/devel/src/apheleia/kolab.git/src/vendor/mockery/mockery/library/Mockery/Container.php:226
/home/vanmeeuwen/devel/src/apheleia/kolab.git/src/vendor/mockery/mockery/library/Mockery.php:118
/home/vanmeeuwen/devel/src/apheleia/kolab.git/src/tests/Feature/Jobs/ProcessDomainCreateTest.php:37
21) Tests\Feature\Jobs\DomainVerifyTest::testHandle
BadMethodCallException: Call to undefined method App\Domain::isVerified()
/home/vanmeeuwen/devel/src/apheleia/kolab.git/src/vendor/laravel/framework/src/Illuminate/Support/Traits/ForwardsCalls.php:50
/home/vanmeeuwen/devel/src/apheleia/kolab.git/src/vendor/laravel/framework/src/Illuminate/Support/Traits/ForwardsCalls.php:36
/home/vanmeeuwen/devel/src/apheleia/kolab.git/src/vendor/laravel/framework/src/Illuminate/Database/Eloquent/Model.php:1618
/home/vanmeeuwen/devel/src/apheleia/kolab.git/src/tests/Feature/Jobs/ProcessDomainVerifyTest.php:39
22) Tests\Feature\Jobs\DomainVerifyTest::testHandleNonExisting
BadMethodCallException: Call to undefined method App\Domain::isVerified()
/home/vanmeeuwen/devel/src/apheleia/kolab.git/src/vendor/laravel/framework/src/Illuminate/Support/Traits/ForwardsCalls.php:50
/home/vanmeeuwen/devel/src/apheleia/kolab.git/src/vendor/laravel/framework/src/Illuminate/Support/Traits/ForwardsCalls.php:36
/home/vanmeeuwen/devel/src/apheleia/kolab.git/src/vendor/laravel/framework/src/Illuminate/Database/Eloquent/Model.php:1618
/home/vanmeeuwen/devel/src/apheleia/kolab.git/src/tests/Feature/Jobs/ProcessDomainVerifyTest.php:62
23) Tests\Feature\Jobs\UserCreateTest::testHandle
Mockery\Exception\RuntimeException: Could not load mock App\Backends\LDAP, class already exists
/home/vanmeeuwen/devel/src/apheleia/kolab.git/src/vendor/mockery/mockery/library/Mockery/Container.php:226
/home/vanmeeuwen/devel/src/apheleia/kolab.git/src/vendor/mockery/mockery/library/Mockery.php:118
/home/vanmeeuwen/devel/src/apheleia/kolab.git/src/tests/Feature/Jobs/UserCreateTest.php:31
24) Tests\Feature\SkuTest::testRegisterEntitlement
Error: Class name must be a valid object or a string
/home/vanmeeuwen/devel/src/apheleia/kolab.git/src/app/Sku.php:69
/home/vanmeeuwen/devel/src/apheleia/kolab.git/src/tests/Feature/SkuTest.php:134
--
There were 9 failures:
1) Tests\Browser\DomainTest::testDomainInfoUnauth
Actual path [/domain/123] does not equal expected path [/login].
Failed asserting that '/domain/123' matches PCRE pattern "/^\/login$/u".
/home/vanmeeuwen/devel/src/apheleia/kolab.git/src/vendor/laravel/dusk/src/Concerns/MakesUrlAssertions.php:166
/home/vanmeeuwen/devel/src/apheleia/kolab.git/src/tests/Browser/Pages/Home.php:28
/home/vanmeeuwen/devel/src/apheleia/kolab.git/src/vendor/laravel/dusk/src/Browser.php:187
/home/vanmeeuwen/devel/src/apheleia/kolab.git/src/tests/Browser/DomainTest.php:24
/home/vanmeeuwen/devel/src/apheleia/kolab.git/src/vendor/laravel/dusk/src/Concerns/ProvidesBrowser.php:68
/home/vanmeeuwen/devel/src/apheleia/kolab.git/src/tests/Browser/DomainTest.php:25
2) Tests\Browser\DomainTest::testDomainInfo404
Actual path [/domain/123] does not equal expected path [/login].
Failed asserting that '/domain/123' matches PCRE pattern "/^\/login$/u".
/home/vanmeeuwen/devel/src/apheleia/kolab.git/src/vendor/laravel/dusk/src/Concerns/MakesUrlAssertions.php:166
/home/vanmeeuwen/devel/src/apheleia/kolab.git/src/tests/Browser/Pages/Home.php:28
/home/vanmeeuwen/devel/src/apheleia/kolab.git/src/vendor/laravel/dusk/src/Browser.php:187
/home/vanmeeuwen/devel/src/apheleia/kolab.git/src/tests/Browser/DomainTest.php:39
/home/vanmeeuwen/devel/src/apheleia/kolab.git/src/vendor/laravel/dusk/src/Concerns/ProvidesBrowser.php:68
/home/vanmeeuwen/devel/src/apheleia/kolab.git/src/tests/Browser/DomainTest.php:46
3) Tests\Browser\LogonTest::testLogonMenu
Actual path [/] does not equal expected path [/login].
Failed asserting that '/' matches PCRE pattern "/^\/login$/u".
/home/vanmeeuwen/devel/src/apheleia/kolab.git/src/vendor/laravel/dusk/src/Concerns/MakesUrlAssertions.php:166
/home/vanmeeuwen/devel/src/apheleia/kolab.git/src/tests/Browser/Pages/Home.php:28
/home/vanmeeuwen/devel/src/apheleia/kolab.git/src/vendor/laravel/dusk/src/Browser.php:187
/home/vanmeeuwen/devel/src/apheleia/kolab.git/src/vendor/laravel/dusk/src/Browser.php:159
/home/vanmeeuwen/devel/src/apheleia/kolab.git/src/tests/Browser/LogonTest.php:23
/home/vanmeeuwen/devel/src/apheleia/kolab.git/src/vendor/laravel/dusk/src/Concerns/ProvidesBrowser.php:68
/home/vanmeeuwen/devel/src/apheleia/kolab.git/src/tests/Browser/LogonTest.php:27
4) Tests\Browser\LogonTest::testLogonWrongCredentials
Actual path [/] does not equal expected path [/login].
Failed asserting that '/' matches PCRE pattern "/^\/login$/u".
/home/vanmeeuwen/devel/src/apheleia/kolab.git/src/vendor/laravel/dusk/src/Concerns/MakesUrlAssertions.php:166
/home/vanmeeuwen/devel/src/apheleia/kolab.git/src/tests/Browser/Pages/Home.php:28
/home/vanmeeuwen/devel/src/apheleia/kolab.git/src/vendor/laravel/dusk/src/Browser.php:187
/home/vanmeeuwen/devel/src/apheleia/kolab.git/src/vendor/laravel/dusk/src/Browser.php:159
/home/vanmeeuwen/devel/src/apheleia/kolab.git/src/tests/Browser/LogonTest.php:54
/home/vanmeeuwen/devel/src/apheleia/kolab.git/src/vendor/laravel/dusk/src/Concerns/ProvidesBrowser.php:68
/home/vanmeeuwen/devel/src/apheleia/kolab.git/src/tests/Browser/LogonTest.php:61
5) Tests\Browser\LogonTest::testLogonSuccessful
Actual path [/] does not equal expected path [/login].
Failed asserting that '/' matches PCRE pattern "/^\/login$/u".
/home/vanmeeuwen/devel/src/apheleia/kolab.git/src/vendor/laravel/dusk/src/Concerns/MakesUrlAssertions.php:166
/home/vanmeeuwen/devel/src/apheleia/kolab.git/src/tests/Browser/Pages/Home.php:28
/home/vanmeeuwen/devel/src/apheleia/kolab.git/src/vendor/laravel/dusk/src/Browser.php:187
/home/vanmeeuwen/devel/src/apheleia/kolab.git/src/vendor/laravel/dusk/src/Browser.php:159
/home/vanmeeuwen/devel/src/apheleia/kolab.git/src/tests/Browser/LogonTest.php:72
/home/vanmeeuwen/devel/src/apheleia/kolab.git/src/vendor/laravel/dusk/src/Concerns/ProvidesBrowser.php:68
/home/vanmeeuwen/devel/src/apheleia/kolab.git/src/tests/Browser/LogonTest.php:81
6) Tests\Browser\SignupTest::testSignupStep0
Element [body #step0] is not present.
Failed asserting that false is true.
/home/vanmeeuwen/devel/src/apheleia/kolab.git/src/vendor/laravel/dusk/src/Concerns/MakesAssertions.php:581
/home/vanmeeuwen/devel/src/apheleia/kolab.git/src/tests/Browser/Pages/Signup.php:30
/home/vanmeeuwen/devel/src/apheleia/kolab.git/src/vendor/laravel/dusk/src/Browser.php:187
/home/vanmeeuwen/devel/src/apheleia/kolab.git/src/vendor/laravel/dusk/src/Browser.php:159
/home/vanmeeuwen/devel/src/apheleia/kolab.git/src/tests/Browser/SignupTest.php:92
/home/vanmeeuwen/devel/src/apheleia/kolab.git/src/vendor/laravel/dusk/src/Concerns/ProvidesBrowser.php:68
/home/vanmeeuwen/devel/src/apheleia/kolab.git/src/tests/Browser/SignupTest.php:139
7) Tests\Browser\SignupTest::testSignupGroup
Element [body #step0] is not present.
Failed asserting that false is true.
/home/vanmeeuwen/devel/src/apheleia/kolab.git/src/vendor/laravel/dusk/src/Concerns/MakesAssertions.php:581
/home/vanmeeuwen/devel/src/apheleia/kolab.git/src/tests/Browser/Pages/Signup.php:30
/home/vanmeeuwen/devel/src/apheleia/kolab.git/src/vendor/laravel/dusk/src/Browser.php:187
/home/vanmeeuwen/devel/src/apheleia/kolab.git/src/vendor/laravel/dusk/src/Browser.php:159
/home/vanmeeuwen/devel/src/apheleia/kolab.git/src/tests/Browser/SignupTest.php:393
/home/vanmeeuwen/devel/src/apheleia/kolab.git/src/vendor/laravel/dusk/src/Concerns/ProvidesBrowser.php:68
/home/vanmeeuwen/devel/src/apheleia/kolab.git/src/tests/Browser/SignupTest.php:492
8) Tests\Feature\Controller\UsersTest::testStatusInfo
Failed asserting that false is identical to true.
/home/vanmeeuwen/devel/src/apheleia/kolab.git/src/tests/Feature/Controller/UsersTest.php:93
9) Tests\Feature\DomainTest::testConfirm
Failed asserting that false is true.
/home/vanmeeuwen/devel/src/apheleia/kolab.git/src/tests/Feature/DomainTest.php:159
ERRORS!
Tests: 108, Assertions: 1131, Errors: 24, Failures: 9, Skipped: 6, Incomplete: 7.

Event Timeline

vanmeeuwen created this object with edit policy "vanmeeuwen (Jeroen van Meeuwen)".